{"text_format":"1","workbook":"xlsx","n_sheets":11,"sheets":["À PROPOS","FAQ","COMMENCER","DonnéesProjet","Résultats","User Add-in Location","DonnéesParDéfaut","Calculs","Déflateurs","Multiplicateurs","Listes"],"not_rendered":{"charts":4,"images":0,"macros":1,"external_links":0,"defined_names":65,"comments":3,"pivot_tables":0},"unopened":[],"bounds":{"document_bytes":16777216,"sheet_cells":100000,"rows_first":2000,"rows_last":500,"rows_between":2000,"halvings":0,"cell_chars":16384,"cell_head_chars":4096},"cells_cut":0,"cells_raw":0,"read":"whole","date_system":"1900"}

{"sheet":"À PROPOS","index":0,"n_rows":23,"n_cols":2,"rows_kept":23,"cut":false,"hidden":false,"merged":[[7,1,11,1]]}
[null,"EI2 - ConfortThermiqueR"]
[]
[null,"Modèle Impacts Économiques des Initiatives d'Électrification (EI2) "]
[]
[]
[null,"Numéro de version: ctr-2021-10-22"]
[]
[null,"   Les modèles « Impacts économiques des initiatives d’électrification » (EI2) reprennent la structure du modèle Jobs and Economic Development Impact (JEDI) élaboré en 2002 pour montrer les avantages économiques du développement de centrales éoliennes terrestres aux États-Unis.  \n\nCe modèle a été adapté à l’échelle des provinces et territoritoires canadiens avec pour premier objectif de fournir aux responsables gouvernementaux, aux décideurs et autres utilisateurs potentiels un outil pour déterminer les retombées économiques locales associées aux mesures d'efficacité énergétique telles que l'installation de technologies de confort thermique. Le second objectif est de faciliter l’accès au modèle et son utilisation à grande échelle."]
[]
[]
{"$rows_left_out":14}
{"sheet":"FAQ","index":1,"n_rows":41,"n_cols":2,"rows_kept":41,"cut":false,"hidden":false,"merged":[]}
[]
[null,"EI2 - ConfortThermiqueR"]
[]
[null,"Modèle Impacts Économiques des Initiatives d'Électrification (EI2) "]
[]
[null,"Foire aux questions (FAQ)"]
[]
[]
[null,"Comment savoir si je dispose de la version la plus récente du modèle EI2 ?"]
[null,"La version la plus récente du modèle est disponible sur le site web de l'initiative de modélisation énergétique à l'adresse https://emi-ime.ca/.  "]
{"$rows_left_out":32}
{"sheet":"COMMENCER","index":2,"n_rows":4,"n_cols":2,"rows_kept":4,"cut":false,"hidden":false,"merged":[]}
[]
[]
[null,"EI2 - ConfortThermiqueR"]
[null,"Modèle Impacts Économiques des Initiatives d'Électrification (EI2) "]

{"sheet":"DonnéesProjet","index":3,"n_rows":51,"n_cols":36,"rows_kept":51,"cut":false,"hidden":false,"merged":[[2,0,2,8],[20,0,21,0],[43,0,43,5],[23,0,23,2],[24,0,24,5],[34,0,34,5],[25,0,25,5]]}
["EI2 - Confort Thermique Résidentiel (EI2-CTR)"]
[]
["INSTRUCTIONS :\n   1. Commencez par saisir la localisation du projet (dans la liste déroulante) et autres données descriptives. Après avoir saisi des données, appuyez sur la touche «Entrée» (ou passez à la case suivante) pour continuer. \n   2. Une fois les données descriptives saisies, choisissez « O » ou « N » à la ligne 21 pour continuer. Choisissez « O » pour accepter les valeurs par défaut des coûts du projet et de la part locale ou « N » pour vérifier ou modifier ces valeurs.\n   3. Une fois toutes les valeurs déterminées, cliquez sur le bouton « Aller aux résultats ».\n\nPour appliquer les nouvelles valeurs dans l'analyse, vous devez répondre « N » à la question « Utiliser les valeurs par défaut du modèle (ci-dessous) ? » – Ligne 21.\nVous pouvez obtenir des informations supplémentaires en plaçant le curseur sur les triangles rouges situés dans les coins des cellules et dans l'onglet FAQ.\nSeules les cellules à fond blanc peuvent être modifiées (et accepter de nouvelles valeurs).\n"]
[]
[]
["Données descriptives du projet"]
["Description du projet"]
["Nom du projet","Project 1"]
["Localisation du projet","Ontario",null,null,null,null,null,null,null,null,null,null,null,null,null,null,null,null,null,null,null,null,null,null,null,null,{"$f":"IF(B9=\"MYREGION\",IF(B10=\"\",2,1),0)","v":0}]
[]
{"$rows_left_out":42}
{"sheet":"Résultats","index":4,"n_rows":38,"n_cols":37,"rows_kept":38,"cut":false,"hidden":false,"merged":[[36,0,36,4]]}
["EI2 - CTR"]
[{"$f":"CONCATENATE(\"Mesures de confort thermique - Résumé des données du projet sur la base des valeurs \",$AE$5)","v":"Mesures de confort thermique - Résumé des données du projet sur la base des valeurs par défaut du modèle"}]
["Localisation du projet",null,{"$f":"IF(DonnéesProjet!B9=\"MyCounty\",'User Add-in Location'!#REF!,DonnéesProjet!B9)","v":"Ontario"},null,null,null,null,null,null,null,null,null,null,null,null,null,null,null,null,null,null,null,null,null,null,null,null,null,null,null,{"$f":"D7+D8","v":18526.16},{"$f":"DonnéesProjet!B21","v":"O"}]
["Année d'installation",null,{"$f":"DonnéesProjet!B16","v":2022},null,null,null,null,null,null,null,null,null,null,null,null,null,null,null,null,null,null,null,null,null,null,null,null,null,null,null,{"$f":"DonnéesParDéfaut!F7+DonnéesParDéfaut!G7","v":18526.16}]
["Nombre d'installations",null,{"$f":"DonnéesProjet!B12","v":5000},null,null,null,null,null,null,null,null,null,null,null,null,null,null,null,null,null,null,null,null,null,null,null,null,null,null,null,{"$f":"IF(AND(ROUND(AE3,2)=ROUND(AE4,2),AF3=\"O\"),\"par défaut du modèle\",\"révisées par l'utilisateur\")","v":"par défaut du modèle"}]
[]
["Coût d'installation du projet ($/technologie)",null,{"$f":"Calculs!D11/Résultats!C5","v":19738.252799999998},{"$f":"DonnéesProjet!B19","v":18276.16},"sans taxes",null,null,null,null,null,null,null,null,null,null,null,null,null,null,null,null,null,null,null,null,null,null,null,null,null,{"$f":"_xlfn.CONCAT(\"EI2-TCR_\",DonnéesProjet!B8)","v":"EI2-TCR_Project 1"}]
["Coûts d'opération et de maintenance ($/technologie)",null,{"$f":"Calculs!D18/Résultats!C5","v":250},{"$f":"DonnéesProjet!B20","v":250},"sans taxes"]
["Valeur monétaire (année de référence)",null,{"$f":"DonnéesProjet!B17","v":2020}]
["Coût d'installation total",null,{"$f":"Calculs!D11","v":98691264}]
{"$rows_left_out":29}
{"sheet":"User Add-in Location","index":5,"n_rows":208,"n_cols":6,"rows_kept":208,"cut":false,"hidden":true,"merged":[]}
["Multipliers For Economic Input-Output Analysis"]
[]
["MYREGION (Name)",null,"Year of Data",null,""]
["Province or Territory (Name)"]
[]
["Jobs Direct Multipliers",null,null,null,"Personal Consumption Expenditures (PCE)"]
["Jobs Per Million Dollars Change in Final Demand","MyRegion",null,null,"MYREGION"]
["Agriculture",0,null,null,0]
["Mining",0,null,null,0]
["Construction",0,null,null,0]
{"$rows_left_out":199}
{"sheet":"DonnéesParDéfaut","index":6,"n_rows":66,"n_cols":58,"rows_kept":66,"cut":false,"hidden":false,"merged":[[0,0,16,1]]}
["*** AVERTISSEMENT ***\n\nCette feuille de calcul contient des données et des formules qui font partie intégrante du modèle EI2. \nBien que ces données et formules soient consultables pour examen, elles ne doivent pas être modifiées.\nToute modification des données ou des formules affectera l'analyse et pourrait invalider les résultats du modèle.\n\nPour les visualiser, faites simplement défiler les colonnes vers la droite.",null,null,null,null,null,null,null,null,null,null,null,null,null,null,null,null,null,null,null,null,"Changement annuel",null,null,null,null,null,null,null,null,null,null,null,null,null,null,null,null,null,null,null,null,null,null,null,null,null,null,"CVAC",null,"Part lde main d'œuvre dans les coûts"]
[null,null,null,null,null,null,null,null,null,null,null,null,null,null,null,null,null,null,null,null,null,-5.0000000000000001E-3,null,null,null,null,null,null,null,null,null,null,null,null,null,null,null,null,null,null,null,null,null,null,null,null,null,null,"Pompe à chaleur air-source pour climat froid",1,0.45]
[null,null,null,null,null,null,null,null,null,null,null,null,null,null,null,null,null,null,null,null,null,null,null,null,null,null,null,null,null,null,null,null,null,null,null,null,null,null,null,null,null,null,null,null,null,null,null,null,"Chaudière électrique",2,0.45]
[null,null,null,null,null,null,null,null,null,null,null,null,null,null,null,null,2021,2022,2023,2024,2025,2026,2027,2028,2029,2030,2031,2032,2033,2034,2035,2036,2037,2038,2039,2040,null,null,null,null,null,null,null,null,null,null,null,null,"Amélioration de l'enveloppe du batîment",null,"Part de la main d'œuvre dans les coûts"]
[null,null,null,null,null,null,null,null,null,null,null,null,null,null,null,null,1,2,3,4,5,6,7,8,9,10,11,12,13,14,15,16,17,18,19,20,null,null,null,null,null,null,null,null,null,null,null,null,"Isolation du grenier (atteindre un RSI minimum de 8,81 ou R-50)",3,0.7]
[null,null,null,"Nombre d'instalaltions",null,"Coût d'installation par défaut par technologie","Coût par défaut de maintenance par technologie / an",null,null,null,null,null,null,null,null,"Pompe à chaleur air-source pour climat froid",{"$f":"VLOOKUP(DonnéesProjet!B$9,DonnéesParDéfaut!AW$12:BE$26,2,FALSE)","v":18368},{"$f":"Q6*(1+$V$2)","v":18276.16},{"$f":"R6*(1+$V$2)","v":18184.779200000001},18093.855304000001,18003.386027479999,17913.369097342598,17823.802251855886,17734.683240596605,17646.009824393623,17557.779775271654,17469.990876395295,17382.640922013317,17295.72771740325,17209.249078816232,17123.20283342215,17037.586819255041,16952.398885158764,16867.636890732971,16783.298706279307,16699.382212747911,null,null,null,null,null,null,null,null,null,null,null,null,"Isolation du toit plat et/ou du plafond cathédrale (atteindre un RSI minimum de 4,93 ou R-28)",4,0.7]
[null,null,null,{"$f":"DonnéesProjet!B12","v":5000},null,{"$f":"Q16","v":18276.16},{"$f":"Q17","v":250},null,null,null,null,null,null,null,null,"Chaudière électrique",{"$f":"VLOOKUP(DonnéesProjet!B$9,DonnéesParDéfaut!AW$12:BE$26,3,FALSE)","v":5390},{"$f":"Q7*(1+$V$2)","v":5363.05},5336.2347500000005,5309.5535762500003,5283.00580836875,5256.5907793269062,5230.3078254302718,5204.1562863031204,5178.135504871605,5152.2448273472473,5126.4836032105113,5100.8511851944586,5075.3469292684858,5049.970194622143,5024.7203436490327,4999.5967419307872,4974.5987582211328,4949.7257644300271,4924.9771356078772,4900.3522499298379,null,null,null,null,null,null,null,null,null,null,null,null,"Isolation du sous-sol / des fondations (isoler au moins 60 % de la surface) ",5,0.7]
[null,null,null,null,null,null,null,null,null,null,null,null,null,null,null,"Isolation du grenier (atteindre un RSI minimum de 8,81 ou R-50)",{"$f":"VLOOKUP(DonnéesProjet!B$9,DonnéesParDéfaut!AW$12:BE$26,4,FALSE)","v":1721.8593573642409},1713.2500605774196,1704.6838102745326,1696.1603912231599,1687.6795892670441,1679.2411913207088,1670.8449853641052,1662.4907604372847,1654.1783066350984,1645.9074151019229,1637.6778780264133,1629.4894886362813,1621.3420411930999,1613.2353309871344,1605.1691543321988,1597.1433085605379,1589.1575920177352,1581.2118040576465,1573.3057450373583,1565.4392163121715,null,null,null,null,null,null,null,null,null,null,null,null,"Isolation des murs extérieurs (100 % de la surface aux niveaux du CNB 2012)",6,0.4]
[null,null,null,null,null,null,null,null,null,null,null,null,null,null,null,"Isolation du toit plat et/ou du plafond cathédrale (atteindre un RSI minimum de 4,93 ou R-28)",{"$f":"VLOOKUP(DonnéesProjet!B$9,DonnéesParDéfaut!AW$12:BE$26,5,FALSE)","v":1512.4317139960003},1504.8695554260203,1497.3452076488902,1489.8584816106456,1482.4091892025924,1474.9971432565794,1467.6221575402965,1460.284046752595,1452.9826265188321,1445.7177133862381,1438.4891248193069,1431.2966791952103,1424.1401957992343,1417.0194948202382,1409.9343973461368,1402.884725359406,1395.8703017326091,1388.890950223946,1381.9464954728262,1375.0367629954621,null,null,null,null,null,null,null,null,null,null,null,null,"Étanchéité à l'air",7,0.7]
[null,null,null,"Coût d'installation par technologie","Coût d'installation total","Coût de maintenance par technologie / an","Coût total d'installation / an",null,null,null,null,null,null,null,null,"Isolation du sous-sol / des fondations (isoler au moins 60 % de la surface) ",{"$f":"VLOOKUP(DonnéesProjet!B$9,DonnéesParDéfaut!AW$12:BE$26,6,FALSE)","v":3407.0254617888668},{"$f":"Q10*(1+$V$2)","v":3389.9903344799222},3373.0403828075227,3356.175180893485,3339.3943049890177,3322.6973334640725,3306.0838467967519,3289.5534275627683,3273.1056604249543,3256.7401321228294,3240.4564314622153,3224.2541493049043,3208.1328785583796,3192.0922141655878,3176.1317530947599,3160.2510943292859,3144.4498388576394,3128.7275896633514,3113.0839517150348,3097.5185319564598,null,null,null,null,null,null,null,null,null,null,null,null,"Remplacement des portes et des fenêtres (facteur U de 1,08 W/m2-K et homologation Energy Star).",8,0.4]
{"$rows_left_out":57}
{"sheet":"Calculs","index":7,"n_rows":138,"n_cols":37,"rows_kept":138,"cut":false,"hidden":false,"merged":[[39,12,39,23],[31,12,31,23],[0,0,16,1]]}
["*** AVERTISSEMENT ***\n\nCette feuille de calcul contient des données et des formules qui font partie intégrante du modèle EI2. \nBien que ces données et formules soient consultables pour examen, elles ne doivent pas être modifiées.\nToute modification des données ou des formules affectera l'analyse et pourrait invalider les résultats du modèle.\n\nPour les visualiser, faites simplement défiler les colonnes vers la droite.",null,"Analyse d'impact économiques de",{"$f":"CONCATENATE(DonnéesProjet!B12,\" \",DonnéesProjet!B11)","v":"5000 Pompe à chaleur air-source pour climat froid"},null,null,"en",{"$f":"DonnéesProjet!B9","v":"Ontario"}]
[]
[]
[null,null,null,"Coût","Part achetée localement",null,"Dépenses locale",null,null,null,null,null,null,null,null,null,null,null,null,null,null,null,null,null,null,null,null,"Project Installation Costs ","Cost","Local Share"]
[]
[null,null,"Coûts d'équipement, matériau et installation",null,null,null,null,null,null,null,null,null,null,null,null,null,null,null,null,null,null,null,null,null,null,null,null,"Equipment & Installation costs"]
[null,null,{"$f":"DonnéesParDéfaut!C17","v":"Pompe à chaleur air-source pour climat froid"},{"$f":"IF(DonnéesProjet!$B$21=\"O\",DonnéesParDéfaut!D17,DonnéesProjet!B29)","v":50259440.000000007},{"$f":"IF(DonnéesProjet!$B$21=\"O\",DonnéesParDéfaut!F17,DonnéesProjet!E29)","v":1},null,{"$f":"D7*E7","v":50259440.000000007},null,null,null,null,null,null,null,null,null,null,null,null,null,null,null,null,null,null,null,null,{"$f":"C7","v":"Pompe à chaleur air-source pour climat froid"},{"$f":"D7","v":50259440.000000007},1]
[null,null,"Main d'œuvre",{"$f":"IF(DonnéesProjet!$B$21=\"O\",DonnéesParDéfaut!D18,DonnéesProjet!B30)","v":41121360},{"$f":"IF(DonnéesProjet!$B$21=\"O\",DonnéesParDéfaut!F18,DonnéesProjet!E30)","v":1},null,{"$f":"D8*E8","v":41121360},null,null,null,null,null,null,null,null,null,null,null,null,null,null,null,null,null,null,null,null,"Labour",41121360,1]
[null,null,"Sous-total (ensemble des coûts sans les taxes)\n",{"$f":"D7+D8","v":91380800},{"$f":"IF(DonnéesProjet!$B$21=\"O\",DonnéesParDéfaut!F19,DonnéesProjet!E31)","v":1},null,{"$f":"D9*E9","v":91380800},null,null,null,null,null,null,null,null,null,null,null,null,null,null,null,null,null,null,null,null,"Subtotal All Costs (without sales tax)",91380800,1]
[null,null,"Taxes de vente",{"$f":"IF(DonnéesProjet!$B$21=\"O\",DonnéesParDéfaut!D20,DonnéesProjet!B32)","v":7310464},{"$f":"IF(DonnéesProjet!$B$21=\"O\",DonnéesParDéfaut!F20,DonnéesProjet!E32)","v":1},null,{"$f":"D10*E10","v":7310464},null,null,null,null,null,null,null,null,null,null,null,null,null,null,null,null,null,null,null,null,"Sales Tax",7310464,1]
{"$rows_left_out":129}
{"sheet":"Déflateurs","index":8,"n_rows":60,"n_cols":49,"rows_kept":60,"cut":false,"hidden":false,"merged":[[0,0,16,1]]}
["*** AVERTISSEMENT ***\n\nCette feuille de calcul contient des données et des formules qui font partie intégrante du modèle EI2. \nBien que ces données et formules soient consultables pour examen, elles ne doivent pas être modifiées.\nToute modification des données ou des formules affectera l'analyse et pourrait invalider les résultats du modèle.\n\nPour les visualiser, faites simplement défiler les colonnes vers la droite.",null,"Déflateurs / Inflateurs"]
[null,null,"Pour assurer la consistance entre les multiplicateurs et les données projet"]
[]
[null,null,"Année des multiplicateurs",null,2017,null,null,null,"Déflateur",{"$f":"HLOOKUP($E$5,D9:AW51,$D$60)","v":0.94890510948905105}]
[null,null,"Dollars de l'année",null,{"$f":"DonnéesProjet!B17","v":2020},null,null,null,"Inflateur",{"$f":"HLOOKUP($E$5,D9:AW51,$D$59)","v":1.0538461538461539}]
[]
[]
[]
[null,null,null,2005,2006,2007,2008,2009,2010,2011,2012,2013,2014,2015,2016,2017,2018,2019,2020,2021,2022,2023,2024,2025,2026,2027,2028,2029,2030,2031,2032,2033,2034,2035,2036,2037,2038,2039,2040,2041,2042,2043,2044,2045,2046,2047,2048,2049,2050]
[null,null,2005,1,1.0186915887850467,1.0467289719626169,1.0654205607476634,1.0654205607476634,1.0934579439252334,1.1214953271028036,1.1401869158878504,1.1495327102803738,1.1682242990654206,1.1869158878504673,1.1962616822429906,1.2149532710280373,1.2429906542056075,1.2710280373831775,1.280373831775701,1.2990654205607475,1.3271028037383177,1.3457943925233644,1.3738317757009344,1.3925233644859811,1.4205607476635513,1.4485981308411215,1.485981308411215,1.514018691588785,1.5514018691588782,1.5794392523364484,1.6168224299065419,1.6542056074766354,1.6822429906542056,1.719626168224299,1.7570093457943923,1.7943925233644857,1.8224299065420559,1.8598130841121494,1.8971962616822426,1.9345794392523361,1.9813084112149533,2.018691588785047,2.0560747663551404,2.1028037383177569,2.1495327102803734,2.1869158878504669,2.2336448598130842,2.2803738317757007,2.3364485981308412]
{"$rows_left_out":51}
{"sheet":"Multiplicateurs","index":9,"n_rows":312,"n_cols":26,"rows_kept":312,"cut":false,"hidden":false,"merged":[[0,0,16,1]]}
["*** AVERTISSEMENT ***\n\nCette feuille de calcul contient des données et des formules qui font partie intégrante du modèle EI2. \nBien que ces données et formules soient consultables pour examen, elles ne doivent pas être modifiées.\nToute modification des données ou des formules affectera l'analyse et pourrait invalider les résultats du modèle.\n\nPour les visualiser, faites simplement défiler les colonnes vers la droite.",null,{"$f":"DonnéesProjet!B9","v":"Ontario"}]
[]
[]
[]
[null,null,"Multiplicateurs"]
[null,null,null,"Emplois",null,null,"Revenus d'emploi",null,null,"Extrant",null,null,"Valeur ajoutée"]
[null,null,null,"Direct","Indirect","Induit","Direct","Indirect","Induit","Direct","Indirect","Induit","Direct","Indirect","Induit",null,null,null,null,"Facteur taux horaire","Impôts sur le revenu",null,null,"CPP + EI",6.83E-2]
[null,null,"Agriculture",{"$f":"IF(C1=D44,M_CA,IF(C1=E44,M_AB,IF(C1=F44,M_BC,IF(C1=G44,M_MB,IF(C1=H44,M_NB,IF(C1=I44,M_NL,IF(C1=J44,M_NT,IF(C1=K44,M_NS,IF(C1=L44,M_NU,IF(C1=M44,M_ON,IF(C1=N44,M_PE,IF(C1=O44,M_QC,IF(C1=P44,M_SK,IF(C1=Q44,M_YK,IF(C1=R44,M_MR,M_0)))))))))))))))","v":5.592289967761392},2.5278535398833273,1.1676441865348695,0.1702889004512857,0.14217090533153673,5.763525418800311E-2,1,0.53608102133942448,0.21218743641594401,0.45240221061225061,0.26937394643216134,0.12403489331428524,null,null,null,"Canada",1,0.16,null,null,"QPP + EI",7.4800000000000005E-2,"Québec"]
[null,null,"Exploitation minière",2.3352522076431912,1.543239120933964,1.4018864288281339,1.0830583043959668E-3,0.10776677546935555,6.9479978694643896E-2,1,0.32327515505099103,0.25445476587198884,0.61986678309851828,0.17603634060763351,0.14916560268912063,null,null,null,"Alberta",1.1148962527098174,0.27]
[null,null,"Construction",4.0821038441454203,2.5373961394133886,1.7001650112340612,0,0.163310003145896,8.4210575282923111E-2,1,0.50493648597208229,0.30851569300497689,0.46160214426882606,0.25215551344566456,0.18094317028775286,null,null,null,"British Columbia",0.99101889129761533,0.22]
{"$rows_left_out":303}
{"sheet":"Listes","index":10,"n_rows":33,"n_cols":9,"rows_kept":33,"cut":false,"hidden":false,"merged":[[0,0,16,1]]}
["*** AVERTISSEMENT ***\n\nCette feuille de calcul contient des données et des formules qui font partie intégrante du modèle EI2. \nBien que ces données et formules soient consultables pour examen, elles ne doivent pas être modifiées.\nToute modification des données ou des formules affectera l'analyse et pourrait invalider les résultats du modèle.\n\nPour les visualiser, faites simplement défiler les colonnes vers la droite."]
[null,null,"Years",null,"States",null,"Yes / No",null,"Technology/Service"]
[null,null,2010,null,"Canada",null,"O",null,"Pompe à chaleur air-source pour climat froid"]
[null,null,2011,null,"Alberta",null,"N",null,"Chaudière électrique"]
[null,null,2012,null,"Colombie-Britannique",null,null,null,"Isolation du grenier (atteindre un RSI minimum de 8,81 ou R-50)"]
[null,null,2013,null,"Manitoba",null,null,null,"Isolation du toit plat et/ou du plafond cathédrale (atteindre un RSI minimum de 4,93 ou R-28)"]
[null,null,2014,null,"Nouveau-Brunswick",null,null,null,"Isolation du sous-sol / des fondations (isoler au moins 60 % de la surface) "]
[null,null,2015,null,"Terre-Neuve-et-Labrador",null,null,null,"Isolation des murs extérieurs (100 % de la surface aux niveaux du CNB 2012)"]
[null,null,2016,null,"Territoires du Nord-Ouest",null,null,null,"Étanchéité à l'air"]
[null,null,2017,null,"Nouvelle-Écosse",null,null,null,"Remplacement des portes et des fenêtres (facteur U de 1,08 W/m2-K et homologation Energy Star)."]
{"$rows_left_out":23}