{"text_format":"1","workbook":"xlsx","n_sheets":11,"sheets":["À PROPOS EI2","FAQ","COMMENCER","DonnéesProjet","Résultats","RégionPersonnalisée","DonnéesParDéfaut","Calculs","Déflateurs","Multiplicateurs","Listes"],"not_rendered":{"charts":4,"images":0,"macros":1,"external_links":0,"defined_names":142,"comments":5,"pivot_tables":0},"unopened":[],"bounds":{"document_bytes":16777216,"sheet_cells":100000,"rows_first":2000,"rows_last":500,"rows_between":2000,"halvings":0,"cell_chars":16384,"cell_head_chars":4096},"cells_cut":0,"cells_raw":0,"read":"whole","date_system":"1900"}

{"sheet":"À PROPOS EI2","index":0,"n_rows":24,"n_cols":2,"rows_kept":24,"cut":false,"hidden":false,"merged":[[7,1,11,1]]}
[null,"EI2 - ÉOLIEN"]
[]
[null,"Modèle Impacts Économiques des Initiatives d'Électrification (EI2) "]
[]
[]
[null,"Numéro de version: e-2021-10-22"]
[]
[null,"   Les modèles « Impacts économiques des initiatives d’électrification » (EI2) reprennent la structure du modèle Jobs and Economic Development Impact (JEDI) élaboré en 2002 pour montrer les avantages économiques du développement de centrales éoliennes terrestres aux États-Unis.\n\nCe modèle a été adapté à l’échelle des provinces et territoritoires canadiens avec pour premier objectif de fournir aux promoteurs d’éoliennes, aux défenseurs des énergies renouvelables, aux responsables gouvernementaux, aux décideurs et autres utilisateurs potentiels un outil pour déterminer les retombées économiques locales de la construction et de l’exploitation de centrales éoliennes. Le second objectif est de faciliter l’accès au modèle et son utilisation à grande échelle.\n"]
[]
[]
[]
[]
[null,"   Conformément à ces objectifs, un format convivial facile à modifier et adapté à différents niveaux d'informations sur le projet et de compétences de l'utilisateur a été privilégié. Cela offre une plus grande flexibilité aux utilisateurs peu habitués aux tableurs ou qui ne maîtrisent pas l'analyse d'impacts économiques, mais aussi aux utilisateurs plus expérimentés et qualifiés qui ont besoin de ce type spécifique d'analyse. "]
[]
[]
[]
[null,"Les modèles EI2 ont été adaptés par Éloïse Edom, associée de recherche à l'Institut de l'énergie Trottier, dans le cadre de l'Initiative de modélisation énergétique soutenue par RNCan."]
[null,"Institut de l'énergie Trottier"]
[null,"Initiative de modélisation énergétique"]
[]
[null,"Pour plus d'information sur la suite de modèles EI2 visitez le site https://emi-ime.ca/ei2/."]
[null,"Ou contacter:"]
[null,"info@emi-ime.ca"]
[null,"eloise.edom@polymtl.ca "]

{"sheet":"FAQ","index":1,"n_rows":60,"n_cols":2,"rows_kept":60,"cut":false,"hidden":false,"merged":[]}
[]
[null,"EI2 - ÉOLIEN"]
[]
[null,"Modèle Impacts Économiques des Initiatives d'Électrification (EI2) "]
[]
[null,"Foire aux questions (FAQ)"]
[]
[]
[null,"Comment savoir si je dispose de la version la plus récente du modèle EI2 ?"]
[null,"La version la plus récente du modèle est disponible sur le site web de l'initiative de modélisation énergétique à l'adresse https://emi-ime.ca/.  "]
[]
[null,"Comment savoir de quelle version du modèle EI2 je dispose ?"]
[null,"La version (le numéro de la version) du modèle que vous utilisez actuellement est indiquée dans la feuille de travail « À propos d'EI2 ».  "]
[]
[null,"À l'ouverture du modèle, je reçois un message d'alerte indiquant que « les macros du fichier ont été désactivées ». Comment modifier les paramètres de sécurité pour pouvoir exécuter le modèle avec les macros désactivées ?"]
[null,"Cliquez sur le bouton \"Activer le contenu\" qui apparaît à gauche de l'alerte de sécurité."]
[]
[null,"Comment effectuer une analyse à l'échelle régionale ?"]
[null,"L’exécution d’une analyse à l’échelle régionale est similaire à celle d’une analyse à l’échelle provinciale ou territoriale, bien qu’il existe deux différences essentielles que l'utilisateur doit garder à l’esprit. Premièrement, comme le modèle ne contient pas de multiplicateurs de niveau régional, il est nécessaire de les obtenir et de les y ajouter. (Consultez la FAQ sur la manière d’obtenir les multiplicateurs de niveau régional et d’ajouter les données). Deuxièmement, pour effectuer une analyse à l’échelle régionale, l'utilisateur doit indiquer la population régionale dans la zone « Description du projet ». La population fournit au modèle une référence pour insérer automatiquement les valeurs par défaut de la « part de dépence locale »."]
[]
[null,"Comment obtenir des données de niveau régional à ajouter au modèle pour effectuer l'analyse dans une région spécifique ?"]
[null,"Les multiplicateurs de niveau régional et les modèles de dépense de consommation des ménages sont disponibles de plusieurs façons. Les utilisateurs qui connaissent bien la modélisation des entrées-sorties peuvent acheter les données brutes de niveau régional et dériver eux-mêmes les multiplicateurs, les acheter auprès d'une personne maîtrisant la modélisation des entrées-sorties, les acheter directement auprès d'IMPLAN (www.implan.com), ou contacter MRG & Associates (mrgassociates@earthlink.net), le développeur du modèle."]
[]
[null,"Comment ajouter les multiplicateurs de niveau régional et les données sur les dépenses de consommation des ménages ?"]
[null,"Pour ajouter les multiplicateurs de niveau régional et les données sur les dépenses de consommation des ménages, il faut copier/coller ces informations sur la feuille de calcul « Région Personnalisée » aux emplacements appropriés. Il est aussi nécessaire de saisir le nom de la région, l'année de collecte des données, et le nom de la province ou du territoire où se situe la région."]
[]
[null,"À quoi correspond la « part locale » ?"]
[null,"La « part locale » est le pourcentage de chaque dépense réellement effectué localement (c’est-à-dire dans la province, le territoire ou la région analysée). Par exemple, si un million de dollars doit être consacré à l’achat de matériaux de construction et que la moitié (500 000 $) de ce montant est dépensée chez des fournisseurs locaux, la « part locale » est dite de 50 %."]
[]
[null,"Que signifie l'expression « équivalent temps plein pendant un an » dans les résultats concernant les emplois ?"]
[null,"Cette expression désigne un emploi à temps plein occupé (et rémunéré) pendant un an, soit 2 080 heures (40 heures hebdomadaires durant 52 semaines). Par exemple, si l'analyse fait état de 100 emplois dans le secteur de la construction, il y aura l'équivalent de 100 travailleurs à temps plein pendant toute l'année. Si la construction dure deux ans, les effets sur l'emploi sont répartis sur deux ans et il y aura par conséquent une moyenne de 50 emplois à temps plein (100 divisés par deux ans) par année. De la même manière, si la construction dure moins d'un an, par exemple 9 mois (ou 75 % d'une année), le nombre de personnes travaillant à temps plein durant cette période sera plus important puisqu'elles ne seront pas employées pendant une année entière. Dans ce cas, il y aura en moyenne 133 travailleurs à temps plein (100 emplois divisés par 0,75 % de l'année) pendant les 9 mois de la construction."]
[]
[null,"Pour que l'analyse soit aussi précise que possible, comment obtenir les informations permettant d’ajuster à ma province, mon territoire ou ma région les valeurs de la « part locale » (dans la feuille de calcul « Données Projet ») ?"]
[null,"Dans la mesure où la « part locale » dépend directement de l’existence d’entreprises et de fournisseurs de services locaux capables de répondre aux besoins de la construction et de l’exploitation du projet, il est important de disposer d'un portrait exact des ressources locales. Ces informations peuvent être obtenues de plusieurs façons, notamment en contactant des personnes compétentes et bien informées dans la région, des associations régionales d’entreprises et d’entrepreneurs ou la chambre de commerce locale."]
[]
[null,"Je souhaite modifier la valeur par défaut des coûts de la main-d’œuvre pour la construction et/ou l’opération et maintenance, les taux de rémunération ou les charges de l’employeur, mais lorsque je le fais, une fenêtre contextuelle m’indique que je ne peux apporter de changement qu’à condition de modifier d’autres cellules relatives aux salaires. Pourquoi ?"]
[null,"Le modèle se sert du coût total de la main-d’œuvre et du salaire horaire moyen pour calculer le nombre d’ouvriers de la construction et d’ouvriers d’O&M. De sorte que si un utilisateur choisit de modifier les valeurs par défaut, les ratios par défaut programmés dans le modèle sont remplacés. Par conséquent, si l’utilisateur augmente le coût total de la main-d’œuvre sans modifier le salaire horaire, les résultats feront apparaître davantage de travailleurs. De même, si le salaire horaire moyen est augmenté sans modification subséquente du coût total de la main-d’œuvre, les résultats feront apparaître moins de travailleurs."]
[]
[null,"Lorsque je modifie les coûts de construction ($ par kW) ou d’E&E ($ par kW) dans la section « Description du projet », les coûts de main-d’œuvre restent inchangés, tandis que les autres coûts du projet varient. Pourquoi tous les coûts du projet ne changent-ils pas ?"]
[null,"Le modèle est conçu pour déterminer les coûts de main-d’œuvre en fonction de valeurs par défaut de salaires de base, de charges salariales, et de ratios d’emploi, à moins que les coûts ne soient revus par l’utilisateur. De ce fait, une modification des coûts totaux de construction ou d’O&M dans la section « Description du projet » n’a pas d’incidence sur les coûts de main-d’œuvre. Consultez également la FAQ au sujet des modifications apportées par l’utilisateur aux coûts de main-d’œuvre."]
[]
[null,"Je souhaiterais voir et éventuellement modifier les formules internes du modèle, comment y accéder ?"]
[null,"Pour effectuer une analyse, le modèle EI2 utilise certaines feuilles de calcul qui ne sont pas conçues pour être modifiées par les utilisateurs. Plusieurs d'entre elles, dont les données par défaut, les calculs et les déflateurs, peuvent toutefois être visualisées en cliquant dessus et en les faisant défiler vers la droite. Mais, bien que consultables, elles sont protégées et ne peuvent être modifiées."]
[]
[null,"Quelle est la source des coûts par défaut?"]
[null,"Les valeurs par défaut proviennet de diverses sources. Les sources comprennent:"]
[null,"Coûts et répartition des coûts"]
[null,"- Delphi Group. (2017). Alberta Wind Energy Supply Chain Study FINAL REPORT. Retrieved from www.delphi.ca"]
[null,"- Compass Renewable Energy Consulting Inc. (2017). Market Analysis of Ontario’s Renewable Energy Sector. Ministry of Energy."]
[null,"- Burdick, A., Li, C., Hull, S., & Ming, Z. (2019). NSPI Resource Options Study. Nova Scotia Power."]
[null,"- Doluweera, G., Fogwill, A., Hossein, H., Karen, M., Nduagu, E., Sow, A., & Umeozor, E. (2018). A Comprehensive Guide To Electricity Generation Options in Canada. \n  Canadian Energy Research Institute. Retrieved from www.ceri.ca"]
[null,"- The model JEDI Land Based Wind Model rel. W9.14.18"]
[null,"Salaires"]
[null,"- Job bank, https://www.jobbank.gc.ca/home\n  (NOC-4 digits, Canada, Provinces and Territories)"]
[null,"Taxes de vente"]
[null,"- Retail council of Canada, https://www.retailcouncil.org/resources/quick-facts/sales-tax-rates-by-province/"]
[]
[null,"Comment obtenir davantage d’informations sur la modélisation des entrées-sorties et l’utilisation du modèle EI2 ?"]
[null,"De plus amples informations sur la manière d’utiliser les modèles EI2 sont disponibles sur https://emi-ime.ca/ei2/."]
[null,"EI2 utilise la même structure que les modèles JEDI développés par NREL. Pour afficher et / ou télécharger les publications liées à JEDI, accédez à https://www.nrel.gov/analysis/jedi/publications.html. "]

{"sheet":"COMMENCER","index":2,"n_rows":4,"n_cols":2,"rows_kept":4,"cut":false,"hidden":false,"merged":[]}
[]
[]
[null,"EI2 - ÉOLIEN"]
[null,"Modèle Impacts Économiques des Initiatives d'Électrification (EI2) "]

{"sheet":"DonnéesProjet","index":3,"n_rows":118,"n_cols":36,"rows_kept":118,"cut":false,"hidden":false,"merged":[[19,0,20,0],[2,0,2,8],[84,0,84,5],[22,0,22,2],[23,0,23,5],[61,0,61,5],[24,0,24,5]]}
[" EI2 - ÉOLIEN"]
["Données sur le projet de parc éolien"]
["INSTRUCTIONS :\n   1. Commencez par saisir la localisation du projet (dans la liste déroulante) et autres données descriptives. Après avoir saisi des données, appuyez sur la touche «Entrée» (ou passez à la case suivante) pour continuer. Si vous réalisez une analyse d'une région personnalisée, complétez d'abord la feuille de calcul «RégionPersonnalisée», puis sélectionner «MARÉGION» comme localisation du projet.\n   2. Une fois les données descriptives saisies, choisissez « O » ou « N » à la ligne 20 pour continuer. Choisissez « O » pour accepter les valeurs par défaut des coûts du projet et de la part locale ou « N » pour vérifier ou modifier ces valeurs.\n   3. Une fois toutes les valeurs déterminées, cliquez sur le bouton « Aller aux résultats ».\n\nPour appliquer les nouvelles valeurs dans l'analyse, vous devez répondre « N » à la question « Utiliser les valeurs par défaut du modèle (ci-dessous) ? » – Ligne 20.\nVous pouvez obtenir des informations supplémentaires en plaçant le curseur sur les triangles rouges situés dans les coins des cellules et dans l'onglet FAQ.\nSeules les cellules à fond blanc peuvent être modifiées (et accepter de nouvelles valeurs).\n"]
[]
[]
["Données descriptives du projet"]
["Description du projet"]
["Nom du projet","Projet 1",{"$f":"IF(B9=\"MARÉGION\",IF(RégionPersonnalisée!E23=0,\"   **Erreur - Absence de multiplicateurs régionaux  dans l'onglet Région personnalisée**\",\"\"),\"\")","v":""}]
["Localisation du projet","Alberta",{"$f":"IF(B9=\"MARÉGION\",IF(RégionPersonnalisée!E23<>0,\"\",\"   Entrer la taille de la population de la région\"),\"\")","v":""},null,null,null,null,null,null,null,null,null,null,null,null,null,null,null,null,null,null,null,null,null,null,null,{"$f":"IF(B9=\"MARÉGION\",IF(B10=\"\",2,1),0)","v":0}]
[{"$f":"IF(B9=\"MARÉGION\",\"Population (Requis seulement si analyse d'une région personnalisée)\",\"\")","v":""},null,{"$f":"IF($C9=\"\",\"\",IF($B10<1,\"   **Erreur - Les données sur la population sont manquantes**\",\"\"))","v":""}]
["Puissance totale du projet (MW)",100]
["Puissance d'une éolienne (kW)",2500]
["Nombre d'éoliennes",{"$f":"DonnéesParDéfaut!D5","v":40}]
["Informations sur la construction"]
["Année de construction",2022]
["Valeur monétaire (année de référence)",2020]
["Informations sur les coûts"]
["Coût d'installation du projet ($/kW)",{"$f":"DonnéesParDéfaut!F5","v":2025.2762431107647}]
["Coûts d'opération et de maintenance ($/kW)",{"$f":"DonnéesParDéfaut!G9","v":25},null,{"$f":"IF(B$19<DonnéesParDéfaut!AT$56,\"**Ces coûts sont potentiellement sous les valeurs typiques de l'industrie.**\",\"\")","v":""}]
["Utiliser les valeurs par défaut des données sur les coûts du projet dans l'analyse ? Choisissez « O » pour accepter les valeurs par défaut ci-dessous ou « N » pour les remplacer par de nouvelles valeurs. Consultez la FAQ pour des informations complémentaires.","O",null,{"$f":"IF($B$20=\"O\",\"Cliquez sur 'Aller aux résultats' \",IF($B$20=\"N\",\"Modifier les coûts détaillés (ci-dessous)\",\"Erreur - Entrer 'O' ou 'N'\"))","v":"Cliquez sur 'Aller aux résultats' "}]
[]
[]
["Si vous le souhaitez, les valeurs par défaut (dans les cellules ci-dessous et établies sur la base des données descriptives saisies précédemment) peuvent être restaurées en cliquant sur le bouton « Réinitialiser les valeurs par défaut ». \nRemarque : il n'est pas nécessaire de restaurer les valeurs par défaut pour incorporer les données sur les coûts du projet par défaut dans l'analyse ; il suffit de choisir « O » dans la cellule B20."]
["Données sur les coûts du projet"]
["Coûts de construction",null,null,null,null,null,null,null,null,null,null,null,null,null,null,null,null,null,null,null,null,null,null,null,null,null,null,null,null,null,null,null,null,"Default Values"]
[null,"Coût","Coût par kW","Pourcentage du coût total","Part locale",null,null,null,null,null,null,null,null,null,null,null,null,null,null,null,null,null,null,null,null,null,null,null,null,null,null,null,null,"Cost","Local Share"]
["Coûts de l'équipement",null,null,null,null,null,null,null,null,null,null,null,null,null,null,null,null,null,null,null,null,null,null,null,null,null,"Local share according to selected state or user defined region"]
["Turbines éoliennes et autres équipements (à l'exclusion des pales et des tours)\n",{"$f":"DonnéesParDéfaut!$D32","v":90235535.824108422},{"$f":"B28/(B$11*1000)","v":902.35535824108422},{"$f":"B28/B$59","v":0.445493085609735},{"$f":"$AA28","v":0},null,null,null,null,null,null,null,null,null,null,null,null,null,null,null,null,null,null,null,null,null,{"$f":"IF($AA$9=0,DonnéesParDéfaut!$G32,IF($AA$9=2,\"Pop. Data Missing\",IF($B$10<DonnéesParDéfaut!$H$13,DonnéesParDéfaut!$H32,IF($B$10<DonnéesParDéfaut!$I$13,DonnéesParDéfaut!$O32,IF($B$10<DonnéesParDéfaut!$J$13,DonnéesParDéfaut!$R32,DonnéesParDéfaut!$U32)))))","v":0},null,null,null,null,null,null,{"$f":"DonnéesParDéfaut!$D32","v":90235535.824108422},{"$f":"$AA28","v":0}]
["Pales",{"$f":"DonnéesParDéfaut!$D33","v":21125376.279891599},{"$f":"B29/(B$11*1000)","v":211.253762798916},{"$f":"B29/B$59","v":0.10429604010930249},{"$f":"$AA29","v":0},null,null,null,null,null,null,null,null,null,null,null,null,null,null,null,null,null,null,null,null,null,{"$f":"IF($AA$9=0,DonnéesParDéfaut!$G33,IF($AA$9=2,\"Pop. Data Missing\",IF($B$10<DonnéesParDéfaut!$H$13,DonnéesParDéfaut!$H33,IF($B$10<DonnéesParDéfaut!$I$13,DonnéesParDéfaut!$O33,IF($B$10<DonnéesParDéfaut!$J$13,DonnéesParDéfaut!$R33,DonnéesParDéfaut!$U33)))))","v":0},null,null,null,null,null,null,{"$f":"DonnéesParDéfaut!$D33","v":21125376.279891599},{"$f":"$AA29","v":0}]
["Tours",{"$f":"DonnéesParDéfaut!$D34","v":23388809.452737126},{"$f":"B30/(B$11*1000)","v":233.88809452737127},{"$f":"B30/B$59","v":0.11547061583529918},{"$f":"$AA30","v":0},null,null,null,null,null,null,null,null,null,null,null,null,null,null,null,null,null,null,null,null,null,{"$f":"IF($AA$9=0,DonnéesParDéfaut!$G34,IF($AA$9=2,\"Pop. Data Missing\",IF($B$10<DonnéesParDéfaut!$H$13,DonnéesParDéfaut!$H34,IF($B$10<DonnéesParDéfaut!$I$13,DonnéesParDéfaut!$O34,IF($B$10<DonnéesParDéfaut!$J$13,DonnéesParDéfaut!$R34,DonnéesParDéfaut!$U34)))))","v":0},null,null,null,null,null,null,{"$f":"DonnéesParDéfaut!$D34","v":23388809.452737126},{"$f":"$AA30","v":0}]
["Transport",{"$f":"DonnéesParDéfaut!$D35","v":16145823.299631439},{"$f":"B31/(B$11*1000)","v":161.45823299631439},{"$f":"B31/B$59","v":7.9711973512109777E-2},{"$f":"$AA31","v":0},null,null,null,null,null,null,null,null,null,null,null,null,null,null,null,null,null,null,null,null,null,{"$f":"IF($AA$9=0,DonnéesParDéfaut!$G35,IF($AA$9=2,\"Pop. Data Missing\",IF($B$10<DonnéesParDéfaut!$H$13,DonnéesParDéfaut!$H35,IF($B$10<DonnéesParDéfaut!$I$13,DonnéesParDéfaut!$O35,IF($B$10<DonnéesParDéfaut!$J$13,DonnéesParDéfaut!$R35,DonnéesParDéfaut!$U35)))))","v":0},null,null,null,null,null,null,{"$f":"DonnéesParDéfaut!$D35","v":16145823.299631439},{"$f":"$AA31","v":0}]
["Total pour l'équipement",{"$f":"SUM(B28:B31)","v":150895544.8563686},{"$f":"SUM(C28:C31)","v":1508.9554485636859},{"$f":"SUM(D28:D31)","v":0.74497171506644644},null,null,null,null,null,null,null,null,null,null,null,null,null,null,null,null,null,null,null,null,null,null,null,null,null,null,null,null,null,{"$f":"SUM(AH28:AH31)","v":150895544.8563686}]
["Systèmes Auxilliaires"]
["Matériaux"]
["Construction (béton, armature, équipement, voies d'accès et préparation du site)",{"$f":"DonnéesParDéfaut!$D18","v":21804406.524476796},{"$f":"B35/(B$11*1000)","v":218.04406524476795},{"$f":"B35/B$59","v":0.1076484142723179},{"$f":"$AA35","v":0.9},null,null,null,null,null,null,null,null,null,null,null,null,null,null,null,null,null,null,null,null,null,{"$f":"IF($AA$9=0,DonnéesParDéfaut!$G18,IF($AA$9=2,\"Pop. Data Missing\",IF($B$10<DonnéesParDéfaut!$H$13,DonnéesParDéfaut!$H18,IF($B$10<DonnéesParDéfaut!$I$13,DonnéesParDéfaut!$O18,IF($B$10<DonnéesParDéfaut!$J$13,DonnéesParDéfaut!$R18,DonnéesParDéfaut!$U18)))))","v":0.9},null,null,null,null,null,null,{"$f":"DonnéesParDéfaut!$D18","v":21804406.524476796},{"$f":"$AA35","v":0.9}]
["Transformateur",{"$f":"DonnéesParDéfaut!$D19","v":2466530.4197062631},{"$f":"B36/(B$11*1000)","v":24.665304197062632},{"$f":"B36/B$59","v":1.2177267385734779E-2},{"$f":"$AA36","v":0},null,null,null,null,null,null,null,null,null,null,null,null,null,null,null,null,null,null,null,null,null,{"$f":"IF($AA$9=0,DonnéesParDéfaut!$G19,IF($AA$9=2,\"Pop. Data Missing\",IF($B$10<DonnéesParDéfaut!$H$13,DonnéesParDéfaut!$H19,IF($B$10<DonnéesParDéfaut!$I$13,DonnéesParDéfaut!$O19,IF($B$10<DonnéesParDéfaut!$J$13,DonnéesParDéfaut!$R19,DonnéesParDéfaut!$U19)))))","v":0},null,null,null,null,null,null,{"$f":"DonnéesParDéfaut!$D19","v":2466530.4197062631},{"$f":"$AA36","v":0}]
["Électricité (câble de dérivation, fil)\n",{"$f":"DonnéesParDéfaut!$D20","v":2599889.7286412967},{"$f":"B37/(B$11*1000)","v":25.998897286412966},{"$f":"B37/B$59","v":1.2835662656396843E-2},{"$f":"$AA37","v":1},null,null,null,null,null,null,null,null,null,null,null,null,null,null,null,null,null,null,null,null,null,{"$f":"IF($AA$9=0,DonnéesParDéfaut!$G20,IF($AA$9=2,\"Pop. Data Missing\",IF($B$10<DonnéesParDéfaut!$H$13,DonnéesParDéfaut!$H20,IF($B$10<DonnéesParDéfaut!$I$13,DonnéesParDéfaut!$O20,IF($B$10<DonnéesParDéfaut!$J$13,DonnéesParDéfaut!$R20,DonnéesParDéfaut!$U20)))))","v":1},null,null,null,null,null,null,{"$f":"DonnéesParDéfaut!$D20","v":2599889.7286412967},{"$f":"$AA37","v":1}]
["Prolongement de la ligne HT",{"$f":"DonnéesParDéfaut!$D21","v":4749131.1675761305},{"$f":"B38/(B$11*1000)","v":47.491311675761303},{"$f":"B38/B$59","v":2.3446473481721117E-2},{"$f":"$AA38","v":0.7},null,null,null,null,null,null,null,null,null,null,null,null,null,null,null,null,null,null,null,null,null,{"$f":"IF($AA$9=0,DonnéesParDéfaut!$G21,IF($AA$9=2,\"Pop. Data Missing\",IF($B$10<DonnéesParDéfaut!$H$13,DonnéesParDéfaut!$H21,IF($B$10<DonnéesParDéfaut!$I$13,DonnéesParDéfaut!$O21,IF($B$10<DonnéesParDéfaut!$J$13,DonnéesParDéfaut!$R21,DonnéesParDéfaut!$U21)))))","v":0.7},null,null,null,null,null,null,{"$f":"DonnéesParDéfaut!$D21","v":4749131.1675761305},{"$f":"$AA38","v":0.7}]
["Sous-total pour les matériaux",{"$f":"SUM(B35:B38)","v":31619957.840400487},{"$f":"SUM(C35:C38)","v":316.19957840400485},{"$f":"SUM(D35:D38)","v":0.15610781779617067},null,null,null,null,null,null,null,null,null,null,null,null,null,null,null,null,null,null,null,null,null,null,null,null,null,null,null,null,null,{"$f":"SUM(AH35:AH38)","v":31619957.840400487}]
["Main-d'œuvre"]
["Fondations",{"$f":"DonnéesParDéfaut!$D24","v":1105050.8286339508},{"$f":"B41/(B$11*1000)","v":11.050508286339507},{"$f":"B41/B$59","v":5.4556389443216049E-3},{"$f":"$AA41","v":0.95},null,null,null,null,null,null,null,null,null,null,null,null,null,null,null,null,null,null,null,null,null,{"$f":"IF($AA$9=0,DonnéesParDéfaut!$G24,IF($AA$9=2,\"Pop. Data Missing\",IF($B$10<DonnéesParDéfaut!$H$13,DonnéesParDéfaut!$H24,IF($B$10<DonnéesParDéfaut!$I$13,DonnéesParDéfaut!$O24,IF($B$10<DonnéesParDéfaut!$J$13,DonnéesParDéfaut!$R24,DonnéesParDéfaut!$U24)))))","v":0.95},null,null,null,null,null,null,{"$f":"DonnéesParDéfaut!$D24","v":1105050.8286339508},{"$f":"$AA41","v":0.95}]
["Édification",{"$f":"DonnéesParDéfaut!$D25","v":1821520.0211889176},{"$f":"B42/(B$11*1000)","v":18.215200211889176},{"$f":"B42/B$59","v":8.9928492952169887E-3},{"$f":"$AA42","v":0.75},null,null,null,null,null,null,null,null,null,null,null,null,null,null,null,null,null,null,null,null,null,{"$f":"IF($AA$9=0,DonnéesParDéfaut!$G25,IF($AA$9=2,\"Pop. Data Missing\",IF($B$10<DonnéesParDéfaut!$H$13,DonnéesParDéfaut!$H25,IF($B$10<DonnéesParDéfaut!$I$13,DonnéesParDéfaut!$O25,IF($B$10<DonnéesParDéfaut!$J$13,DonnéesParDéfaut!$R25,DonnéesParDéfaut!$U25)))))","v":0.75},null,null,null,null,null,null,{"$f":"DonnéesParDéfaut!$D25","v":1821520.0211889176},{"$f":"$AA42","v":0.75}]
["Électricité\n",{"$f":"DonnéesParDéfaut!$D26","v":2444157.5619438435},{"$f":"B43/(B$11*1000)","v":24.441575619438435},{"$f":"B43/B$59","v":1.2066812526155777E-2},{"$f":"$AA43","v":0.7},null,null,null,null,null,null,null,null,null,null,null,null,null,null,null,null,null,null,null,null,null,{"$f":"IF($AA$9=0,DonnéesParDéfaut!$G26,IF($AA$9=2,\"Pop. Data Missing\",IF($B$10<DonnéesParDéfaut!$H$13,DonnéesParDéfaut!$H26,IF($B$10<DonnéesParDéfaut!$I$13,DonnéesParDéfaut!$O26,IF($B$10<DonnéesParDéfaut!$J$13,DonnéesParDéfaut!$R26,DonnéesParDéfaut!$U26)))))","v":0.7},null,null,null,null,null,null,{"$f":"DonnéesParDéfaut!$D26","v":2444157.5619438435},{"$f":"$AA43","v":0.7}]
["Gestion / Encadrement\n",{"$f":"DonnéesParDéfaut!$D27","v":1341768.8448233332},{"$f":"B44/(B$11*1000)","v":13.417688448233331},{"$f":"B44/B$59","v":6.6243164336112319E-3},{"$f":"$AA44","v":0.1},null,null,null,null,null,null,null,null,null,null,null,null,null,null,null,null,null,null,null,null,null,{"$f":"IF($AA$9=0,DonnéesParDéfaut!$G27,IF($AA$9=2,\"Pop. Data Missing\",IF($B$10<DonnéesParDéfaut!$H$13,DonnéesParDéfaut!$H27,IF($B$10<DonnéesParDéfaut!$I$13,DonnéesParDéfaut!$O27,IF($B$10<DonnéesParDéfaut!$J$13,DonnéesParDéfaut!$R27,DonnéesParDéfaut!$U27)))))","v":0.1},null,null,null,null,null,null,{"$f":"DonnéesParDéfaut!$D27","v":1341768.8448233332},{"$f":"$AA44","v":0.1}]
["Divers",{"$f":"DonnéesParDéfaut!$D28","v":7696049.7238209052},{"$f":"B45/(B$11*1000)","v":76.960497238209058},{"$f":"B45/B$59","v":3.7995418403166552E-2},{"$f":"$AA45","v":0.5},null,null,null,null,null,null,null,null,null,null,null,null,null,null,null,null,null,null,null,null,null,{"$f":"IF($AA$9=0,DonnéesParDéfaut!$G28,IF($AA$9=2,\"Pop. Data Missing\",IF($B$10<DonnéesParDéfaut!$H$13,DonnéesParDéfaut!$H28,IF($B$10<DonnéesParDéfaut!$I$13,DonnéesParDéfaut!$O28,IF($B$10<DonnéesParDéfaut!$J$13,DonnéesParDéfaut!$R28,DonnéesParDéfaut!$U28)))))","v":0.5},null,null,null,null,null,null,{"$f":"DonnéesParDéfaut!$D28","v":7696049.7238209052},{"$f":"$AA45","v":0.5}]
["Sous-total pour la main-d'œuvre",{"$f":"SUM(B41:B45)","v":14408546.98041095},{"$f":"SUM(C41:C45)","v":144.08546980410949},{"$f":"SUM(D41:D45)","v":7.1135035602472141E-2},null,null,null,null,null,null,null,null,null,null,null,null,null,null,null,null,null,null,null,null,null,null,null,null,null,null,null,null,null,{"$f":"SUM(AH41:AH45)","v":14408546.98041095}]
["Coûts de développement et autres"]
["Sous-station/interconnexion HT",null,null,null,null,null,null,null,null,null,null,null,null,null,null,null,null,null,null,null,null,null,null,null,null,null,{"$f":"IF($AA$9=0,DonnéesParDéfaut!$G38,IF($AA$9=2,\"Pop. Data Missing\",IF($B$10<DonnéesParDéfaut!$H$13,DonnéesParDéfaut!$H38,IF($B$10<DonnéesParDéfaut!$I$13,DonnéesParDéfaut!$O38,IF($B$10<DonnéesParDéfaut!$J$13,DonnéesParDéfaut!$R38,DonnéesParDéfaut!$U38)))))","v":0.9}]
["Matériel",{"$f":"DonnéesParDéfaut!$D39","v":1498533.4877443062},{"$f":"B49/(B$11*1000)","v":14.985334877443062},{"$f":"B49/B$59","v":7.3982639017739233E-3},{"$f":"$AA49","v":0.9},null,null,null,null,null,null,null,null,null,null,null,null,null,null,null,null,null,null,null,null,null,{"$f":"IF($AA$9=0,DonnéesParDéfaut!$G39,IF($AA$9=2,\"Pop. Data Missing\",IF($B$10<DonnéesParDéfaut!$H$13,DonnéesParDéfaut!$H39,IF($B$10<DonnéesParDéfaut!$I$13,DonnéesParDéfaut!$O39,IF($B$10<DonnéesParDéfaut!$J$13,DonnéesParDéfaut!$R39,DonnéesParDéfaut!$U39)))))","v":0.9},null,null,null,null,null,null,{"$f":"DonnéesParDéfaut!$D39","v":1498533.4877443062},{"$f":"$AA49","v":0.9}]
["Main-d'œuvre",{"$f":"DonnéesParDéfaut!$D40","v":459030.33741939464},4.5903033741939465,2.2662340234124102E-3,0.1,null,null,null,null,null,null,null,null,null,null,null,null,null,null,null,null,null,null,null,null,null,{"$f":"IF($AA$9=0,DonnéesParDéfaut!$G40,IF($AA$9=2,\"Pop. Data Missing\",IF($B$10<DonnéesParDéfaut!$H$13,DonnéesParDéfaut!$H40,IF($B$10<DonnéesParDéfaut!$I$13,DonnéesParDéfaut!$O40,IF($B$10<DonnéesParDéfaut!$J$13,DonnéesParDéfaut!$R40,DonnéesParDéfaut!$U40)))))","v":0.1},null,null,null,null,null,null,{"$f":"DonnéesParDéfaut!$D40","v":459030.33741939464},0.1]
["Ingénierie",{"$f":"DonnéesParDéfaut!$D41","v":2039128.9845455212},20.391289845455212,1.0067185338735761E-2,0,null,null,null,null,null,null,null,null,null,null,null,null,null,null,null,null,null,null,null,null,null,{"$f":"IF($AA$9=0,DonnéesParDéfaut!$G41,IF($AA$9=2,\"Pop. Data Missing\",IF($B$10<DonnéesParDéfaut!$H$13,DonnéesParDéfaut!$H41,IF($B$10<DonnéesParDéfaut!$I$13,DonnéesParDéfaut!$O41,IF($B$10<DonnéesParDéfaut!$J$13,DonnéesParDéfaut!$R41,DonnéesParDéfaut!$U41)))))","v":0},null,null,null,null,null,null,{"$f":"DonnéesParDéfaut!$D41","v":2039128.9845455212},0]
["Services juridiques",{"$f":"DonnéesParDéfaut!$D42","v":1111325.296577309},11.113252965773091,5.4866160096109897E-3,1,null,null,null,null,null,null,null,null,null,null,null,null,null,null,null,null,null,null,null,null,null,{"$f":"IF($AA$9=0,DonnéesParDéfaut!$G42,IF($AA$9=2,\"Pop. Data Missing\",IF($B$10<DonnéesParDéfaut!$H$13,DonnéesParDéfaut!$H42,IF($B$10<DonnéesParDéfaut!$I$13,DonnéesParDéfaut!$O42,IF($B$10<DonnéesParDéfaut!$J$13,DonnéesParDéfaut!$R42,DonnéesParDéfaut!$U42)))))","v":1},null,null,null,null,null,null,{"$f":"DonnéesParDéfaut!$D42","v":1111325.296577309},1]
["Servitudes foncières",{"$f":"DonnéesParDéfaut!$D43","v":0},0,0,1,null,null,null,null,null,null,null,null,null,null,null,null,null,null,null,null,null,null,null,null,null,{"$f":"IF($AA$9=0,DonnéesParDéfaut!$G43,IF($AA$9=2,\"Pop. Data Missing\",IF($B$10<DonnéesParDéfaut!$H$13,DonnéesParDéfaut!$H43,IF($B$10<DonnéesParDéfaut!$I$13,DonnéesParDéfaut!$O43,IF($B$10<DonnéesParDéfaut!$J$13,DonnéesParDéfaut!$R43,DonnéesParDéfaut!$U43)))))","v":1},null,null,null,null,null,null,{"$f":"DonnéesParDéfaut!$D43","v":0},1]
["Permis/certificat d'implantation",{"$f":"DonnéesParDéfaut!$D44","v":519977.89105910808},5.199778910591081,2.5671322613776198E-3,1,null,null,null,null,null,null,null,null,null,null,null,null,null,null,null,null,null,null,null,null,null,{"$f":"IF($AA$9=0,DonnéesParDéfaut!$G44,IF($AA$9=2,\"Pop. Data Missing\",IF($B$10<DonnéesParDéfaut!$H$13,DonnéesParDéfaut!$H44,IF($B$10<DonnéesParDéfaut!$I$13,DonnéesParDéfaut!$O44,IF($B$10<DonnéesParDéfaut!$J$13,DonnéesParDéfaut!$R44,DonnéesParDéfaut!$U44)))))","v":1},null,null,null,null,null,null,{"$f":"DonnéesParDéfaut!$D44","v":519977.89105910808},1]
["Sous-total de coûts de développement et autres",{"$f":"SUM(B49:B54)","v":5627995.9973456394},{"$f":"SUM(C49:C54)","v":56.279959973456393},{"$f":"SUM(D49:D54)","v":2.7785431534910702E-2},null,null,null,null,null,null,null,null,null,null,null,null,null,null,null,null,null,null,null,null,null,null,null,null,null,null,null,null,null,{"$f":"SUM(AH49:AH54)","v":5627995.9973456394}]
["Total systèmes auxilliaires",{"$f":"B39+B46+B55","v":51656500.818157077},{"$f":"C39+C46+C55","v":516.56500818157076},{"$f":"D39+D46+D55","v":0.25502828493355351},null,null,null,null,null,null,null,null,null,null,null,null,null,null,null,null,null,null,null,null,null,null,null,null,null,null,null,null,null,{"$f":"AH39+AH46+AH55","v":51656500.818157077}]
["Sous-total (ensemble des coûts sans les taxes)\n",{"$f":"B32+B56","v":202552045.67452568},{"$f":"B57/(B$11*1000)","v":2025.5204567452568},{"$f":"B57/B$59","v":1},null,null,null,null,null,null,null,null,null,null,null,null,null,null,null,null,null,null,null,null,null,null,null,null,null,null,null,null,null,{"$f":"AH32+AH56","v":202552045.67452568}]
["Taxe de vente (achats de matériel et d'équipement)",{"$f":"DonnéesParDéfaut!$D47","v":0},{"$f":"B58/(B$11*1000)","v":0},{"$f":"B58/B$59","v":0},{"$f":"$E$102","v":1},null,null,null,null,null,null,null,null,null,null,null,null,null,null,null,null,null,null,null,null,null,{"$f":"IF($AA$9=0,DonnéesParDéfaut!$G47,IF($AA$9=2,\"Pop. Data Missing\",IF($B$10<DonnéesParDéfaut!$H$13,DonnéesParDéfaut!$H47,IF($B$10<DonnéesParDéfaut!$I$13,DonnéesParDéfaut!$O47,IF($B$10<DonnéesParDéfaut!$J$13,DonnéesParDéfaut!$R47,DonnéesParDéfaut!$U47)))))","v":1},null,null,null,null,null,null,{"$f":"DonnéesParDéfaut!$D47","v":0},{"$f":"$E$102","v":1}]
["Total",{"$f":"B57+B58","v":202552045.67452568},{"$f":"C57+C58","v":2025.5204567452568},{"$f":"D57+D58","v":1},null,null,null,null,null,null,null,null,null,null,null,null,null,null,null,null,null,null,null,null,null,null,null,null,null,null,null,null,null,{"$f":"AH57+AH58","v":202552045.67452568}]
[]
[]
["Coûts annuels d'opération et de maintenance"]
["","Coût","Coût par kW","Pourcentage du coût total","Part locale ou % du temp sur site (pour travailleur itinérant)",null,null,null,null,null,null,null,null,null,null,null,null,null,null,null,null,null,null,null,null,null,null,null,null,null,null,null,null,"Cost","Local Share or % of Time Onsite (for itinerate workers)"]
["Main-d'œuvre"]
["Personnel"]
["Salaires du personnel de terrain (c.-à-d. techniciens sur place, etc.)",{"$f":"DonnéesParDéfaut!$D55","v":358201.52175897441},{"$f":"B66/(B$11*1000)","v":3.5820152175897442},{"$f":"B66/B$82","v":0.14328060870358977},{"$f":"$AA66","v":1},null,null,null,null,null,null,null,null,null,null,null,null,null,null,null,null,null,null,null,null,null,{"$f":"IF($AA$9=0,DonnéesParDéfaut!$G55,IF($AA$9=2,\"Pop. Data Missing\",IF($B$10<DonnéesParDéfaut!$H$13,DonnéesParDéfaut!$H55,IF($B$10<DonnéesParDéfaut!$I$13,DonnéesParDéfaut!$O55,IF($B$10<DonnéesParDéfaut!$J$13,DonnéesParDéfaut!$R55,DonnéesParDéfaut!$U55)))))","v":1},null,null,null,null,null,null,{"$f":"DonnéesParDéfaut!$D55","v":358201.52175897441},{"$f":"$AA66","v":1}]
["Administration",{"$f":"DonnéesParDéfaut!$D56","v":59934.572028101422},{"$f":"B67/(B$11*1000)","v":0.59934572028101418},{"$f":"B67/B$82","v":2.397382881124057E-2},{"$f":"$AA67","v":1},null,null,null,null,null,null,null,null,null,null,null,null,null,null,null,null,null,null,null,null,null,{"$f":"IF($AA$9=0,DonnéesParDéfaut!$G56,IF($AA$9=2,\"Pop. Data Missing\",IF($B$10<DonnéesParDéfaut!$H$13,DonnéesParDéfaut!$H56,IF($B$10<DonnéesParDéfaut!$I$13,DonnéesParDéfaut!$O56,IF($B$10<DonnéesParDéfaut!$J$13,DonnéesParDéfaut!$R56,DonnéesParDéfaut!$U56)))))","v":1},null,null,null,null,null,null,{"$f":"DonnéesParDéfaut!$D56","v":59934.572028101422},{"$f":"$AA67","v":1}]
["Gestion",{"$f":"DonnéesParDéfaut!$D57","v":142852.72292674455},{"$f":"B68/(B$11*1000)","v":1.4285272292674456},{"$f":"B68/B$82","v":5.7141089170697823E-2},{"$f":"$AA68","v":1},null,null,null,null,null,null,null,null,null,null,null,null,null,null,null,null,null,null,null,null,null,{"$f":"IF($AA$9=0,DonnéesParDéfaut!$G57,IF($AA$9=2,\"Pop. Data Missing\",IF($B$10<DonnéesParDéfaut!$H$13,DonnéesParDéfaut!$H57,IF($B$10<DonnéesParDéfaut!$I$13,DonnéesParDéfaut!$O57,IF($B$10<DonnéesParDéfaut!$J$13,DonnéesParDéfaut!$R57,DonnéesParDéfaut!$U57)))))","v":1},null,null,null,null,null,null,{"$f":"DonnéesParDéfaut!$D57","v":142852.72292674455},{"$f":"$AA68","v":1}]
["Sous-total pour la main-d'œuvre et le personnel",{"$f":"SUM(B66:B68)","v":560988.81671382044},{"$f":"SUM(C66:C68)","v":5.6098881671382044},{"$f":"SUM(D66:D68)","v":0.22439552668552817},null,null,null,null,null,null,null,null,null,null,null,null,null,null,null,null,null,null,null,null,null,null,null,null,null,null,null,null,null,{"$f":"SUM(AH66:AH68)","v":560988.81671382044}]
["Matériel et services"]
["Véhicules",{"$f":"DonnéesParDéfaut!$D63","v":55392.406321559203},{"$f":"B71/(B$11*1000)","v":0.55392406321559207},{"$f":"B71/B$82","v":2.2156962528623682E-2},{"$f":"$AA71","v":1},null,null,null,null,null,null,null,null,null,null,null,null,null,null,null,null,null,null,null,null,null,{"$f":"IF($AA$9=0,DonnéesParDéfaut!$G63,IF($AA$9=2,\"Pop. Data Missing\",IF($B$10<DonnéesParDéfaut!$H$13,DonnéesParDéfaut!$H63,IF($B$10<DonnéesParDéfaut!$I$13,DonnéesParDéfaut!$O63,IF($B$10<DonnéesParDéfaut!$J$13,DonnéesParDéfaut!$R63,DonnéesParDéfaut!$U63)))))","v":1},null,null,null,null,null,null,{"$f":"DonnéesParDéfaut!$D63","v":55392.406321559203},{"$f":"$AA71","v":1}]
["Entretien du site et services divers",{"$f":"DonnéesParDéfaut!$D64","v":21603.038465408088},{"$f":"B72/(B$11*1000)","v":0.21603038465408089},{"$f":"B72/B$82","v":8.6412153861632358E-3},{"$f":"$AA72","v":0.8},null,null,null,null,null,null,null,null,null,null,null,null,null,null,null,null,null,null,null,null,null,{"$f":"IF($AA$9=0,DonnéesParDéfaut!$G64,IF($AA$9=2,\"Pop. Data Missing\",IF($B$10<DonnéesParDéfaut!$H$13,DonnéesParDéfaut!$H64,IF($B$10<DonnéesParDéfaut!$I$13,DonnéesParDéfaut!$O64,IF($B$10<DonnéesParDéfaut!$J$13,DonnéesParDéfaut!$R64,DonnéesParDéfaut!$U64)))))","v":0.8},null,null,null,null,null,null,{"$f":"DonnéesParDéfaut!$D64","v":21603.038465408088},{"$f":"$AA72","v":0.8}]
["Redevances, permis, autorisations",{"$f":"DonnéesParDéfaut!$D65","v":10801.519232704044},0.10801519232704045,4.3206076930816179E-3,1,null,null,null,null,null,null,null,null,null,null,null,null,null,null,null,null,null,null,null,null,null,{"$f":"IF($AA$9=0,DonnéesParDéfaut!$G65,IF($AA$9=2,\"Pop. Data Missing\",IF($B$10<DonnéesParDéfaut!$H$13,DonnéesParDéfaut!$H65,IF($B$10<DonnéesParDéfaut!$I$13,DonnéesParDéfaut!$O65,IF($B$10<DonnéesParDéfaut!$J$13,DonnéesParDéfaut!$R65,DonnéesParDéfaut!$U65)))))","v":1},null,null,null,null,null,null,{"$f":"DonnéesParDéfaut!$D65","v":10801.519232704044},1]
["Services",{"$f":"DonnéesParDéfaut!$D66","v":43206.076930816176},0.43206076930816179,1.7282430772326472E-2,1,null,null,null,null,null,null,null,null,null,null,null,null,null,null,null,null,null,null,null,null,null,{"$f":"IF($AA$9=0,DonnéesParDéfaut!$G66,IF($AA$9=2,\"Pop. Data Missing\",IF($B$10<DonnéesParDéfaut!$H$13,DonnéesParDéfaut!$H66,IF($B$10<DonnéesParDéfaut!$I$13,DonnéesParDéfaut!$O66,IF($B$10<DonnéesParDéfaut!$J$13,DonnéesParDéfaut!$R66,DonnéesParDéfaut!$U66)))))","v":1},null,null,null,null,null,null,{"$f":"DonnéesParDéfaut!$D66","v":43206.076930816176},1]
["Assurances",{"$f":"DonnéesParDéfaut!$D67","v":415443.04741169396},4.15443047411694,0.16617721896467758,0,null,null,null,null,null,null,null,null,null,null,null,null,null,null,null,null,null,null,null,null,null,{"$f":"IF($AA$9=0,DonnéesParDéfaut!$G67,IF($AA$9=2,\"Pop. Data Missing\",IF($B$10<DonnéesParDéfaut!$H$13,DonnéesParDéfaut!$H67,IF($B$10<DonnéesParDéfaut!$I$13,DonnéesParDéfaut!$O67,IF($B$10<DonnéesParDéfaut!$J$13,DonnéesParDéfaut!$R67,DonnéesParDéfaut!$U67)))))","v":0},null,null,null,null,null,null,{"$f":"DonnéesParDéfaut!$D67","v":415443.04741169396},0]
["Carburant (pour les véhicules à moteur)",{"$f":"DonnéesParDéfaut!$D68","v":21603.038465408088},0.21603038465408089,8.6412153861632358E-3,1,null,null,null,null,null,null,null,null,null,null,null,null,null,null,null,null,null,null,null,null,null,{"$f":"IF($AA$9=0,DonnéesParDéfaut!$G68,IF($AA$9=2,\"Pop. Data Missing\",IF($B$10<DonnéesParDéfaut!$H$13,DonnéesParDéfaut!$H68,IF($B$10<DonnéesParDéfaut!$I$13,DonnéesParDéfaut!$O68,IF($B$10<DonnéesParDéfaut!$J$13,DonnéesParDéfaut!$R68,DonnéesParDéfaut!$U68)))))","v":1},null,null,null,null,null,null,{"$f":"DonnéesParDéfaut!$D68","v":21603.038465408088},1]
["Produits, outils et fournitures diverses",{"$f":"DonnéesParDéfaut!$D69","v":140419.75002515258},1.4041975002515257,5.6167900010061028E-2,1,null,null,null,null,null,null,null,null,null,null,null,null,null,null,null,null,null,null,null,null,null,{"$f":"IF($AA$9=0,DonnéesParDéfaut!$G69,IF($AA$9=2,\"Pop. Data Missing\",IF($B$10<DonnéesParDéfaut!$H$13,DonnéesParDéfaut!$H69,IF($B$10<DonnéesParDéfaut!$I$13,DonnéesParDéfaut!$O69,IF($B$10<DonnéesParDéfaut!$J$13,DonnéesParDéfaut!$R69,DonnéesParDéfaut!$U69)))))","v":1},null,null,null,null,null,null,{"$f":"DonnéesParDéfaut!$D69","v":140419.75002515258},1]
["Inventaire des pièces de rechange, de l'équipement et des pièces détachées",{"$f":"DonnéesParDéfaut!$D70","v":1230542.3064334374},12.305423064334374,0.49221692257337496,0.02,null,null,null,null,null,null,null,null,null,null,null,null,null,null,null,null,null,null,null,null,null,{"$f":"IF($AA$9=0,DonnéesParDéfaut!$G70,IF($AA$9=2,\"Pop. Data Missing\",IF($B$10<DonnéesParDéfaut!$H$13,DonnéesParDéfaut!$H70,IF($B$10<DonnéesParDéfaut!$I$13,DonnéesParDéfaut!$O70,IF($B$10<DonnéesParDéfaut!$J$13,DonnéesParDéfaut!$R70,DonnéesParDéfaut!$U70)))))","v":0.02},null,null,null,null,null,null,{"$f":"DonnéesParDéfaut!$D70","v":1230542.3064334374},0.02]
["Sous-total pour le matériel et les services",{"$f":"SUM(B71:B78)","v":1939011.1832861796},{"$f":"SUM(C71:C78)","v":19.390111832861795},{"$f":"SUM(D71:D78)","v":0.7756044733144718},null,null,null,null,null,null,null,null,null,null,null,null,null,null,null,null,null,null,null,null,null,null,null,null,null,null,null,null,null,{"$f":"SUM(AH71:AH78)","v":1939011.1832861796}]
["Taxe de vente (achats de matériel et d'équipement)",{"$f":"DonnéesParDéfaut!$D72","v":0},{"$f":"B80/(B$11*1000)","v":0},{"$f":"B80/B$82","v":0},{"$f":"$AA80","v":1},null,null,null,null,null,null,null,null,null,null,null,null,null,null,null,null,null,null,null,null,null,{"$f":"DonnéesParDéfaut!G72","v":1},null,null,null,null,null,null,{"$f":"DonnéesParDéfaut!$D72","v":0},{"$f":"$AA80","v":1}]
["Autres impôts et frais",{"$f":"DonnéesParDéfaut!$D73","v":0},{"$f":"B81/(B$11*1000)","v":0},{"$f":"B81/B$82","v":0},{"$f":"$AA81","v":1},null,null,null,null,null,null,null,null,null,null,null,null,null,null,null,null,null,null,null,null,null,{"$f":"DonnéesParDéfaut!G73","v":1},null,null,null,null,null,null,{"$f":"DonnéesParDéfaut!$D73","v":0},{"$f":"$AA81","v":1}]
["Total des coûts d'O&M",{"$f":"B69+B79+B80+B81","v":2500000},{"$f":"C69+C79+C80+C81","v":25},{"$f":"D69+D79+D80+D81","v":1},null,null,null,null,null,null,null,null,null,null,null,null,null,null,null,null,null,null,null,null,null,null,null,null,null,null,null,null,null,{"$f":"AH69+AH79+AH80+AH81","v":2500000}]
[]
[]
["Autres paramètres"]
["Paramètres financiers\n",null,null,null,"Part locale",null,null,null,null,null,null,null,null,null,null,null,null,null,null,null,null,null,null,null,null,null,null,null,null,null,null,null,null,null,"Local Share"]
["Financement par emprunt"]
["Pourcentage de financement",{"$f":"DonnéesParDéfaut!$D84","v":0.8},null,null,{"$f":"DonnéesParDéfaut!$G84","v":0},null,null,null,null,null,null,null,null,null,null,null,null,null,null,null,null,null,null,null,null,null,null,null,null,null,null,null,null,{"$f":"DonnéesParDéfaut!$D84","v":0.8},{"$f":"DonnéesParDéfaut!$G84","v":0}]
["Années de financement (échéance)",{"$f":"DonnéesParDéfaut!$D85","v":20},null,null,null,null,null,null,null,null,null,null,null,null,null,null,null,null,null,null,null,null,null,null,null,null,null,null,null,null,null,null,null,{"$f":"DonnéesParDéfaut!$D85","v":20}]
["Taux d'intérêt",{"$f":"DonnéesParDéfaut!$D86","v":6.5000000000000002E-2},null,null,null,null,null,null,null,null,null,null,null,null,null,null,null,null,null,null,null,null,null,null,null,null,null,null,null,null,null,null,null,{"$f":"DonnéesParDéfaut!$D86","v":6.5000000000000002E-2}]
["Financement en fonds propres et remboursement"]
["Pourcentage de fonds propres",{"$f":"1-B88","v":0.19999999999999996},null,null,null,null,null,null,null,null,null,null,null,null,null,null,null,null,null,null,null,null,null,null,null,null,null,null,null,null,null,null,null,{"$f":"1-AH88","v":0.19999999999999996}]
["Investisseurs particuliers (pourcentage du capital total)",{"$f":"DonnéesParDéfaut!$D90","v":0},null,null,{"$f":"DonnéesParDéfaut!$G90","v":1},null,null,null,null,null,null,null,null,null,null,null,null,null,null,null,null,null,null,null,null,null,null,null,null,null,null,null,null,{"$f":"DonnéesParDéfaut!$D90","v":0},{"$f":"DonnéesParDéfaut!$G90","v":1}]
["Sociétés d'investissement (pourcentage du capital total)",{"$f":"DonnéesParDéfaut!$D91","v":1},null,null,{"$f":"DonnéesParDéfaut!$G91","v":0},null,null,null,null,null,null,null,null,null,null,null,null,null,null,null,null,null,null,null,null,null,null,null,null,null,null,null,null,{"$f":"DonnéesParDéfaut!$D91","v":1},{"$f":"DonnéesParDéfaut!$G91","v":0}]
["Rendement des fonds propres (taux d'intérêt annuel)",{"$f":"DonnéesParDéfaut!$D92","v":0.1},null,null,null,null,null,null,null,null,null,null,null,null,null,null,null,null,null,null,null,null,null,null,null,null,null,null,null,null,null,null,null,{"$f":"DonnéesParDéfaut!$D92","v":0.1}]
["Durée de remboursement (années)",{"$f":"DonnéesParDéfaut!$D93","v":20},null,null,null,null,null,null,null,null,null,null,null,null,null,null,null,null,null,null,null,null,null,null,null,null,null,null,null,null,null,null,null,{"$f":"DonnéesParDéfaut!$D93","v":20}]
["Paramètres fiscaux"]
["Taux local de l'impôt foncier (taux par mille - $/1 000 $)",{"$f":"DonnéesParDéfaut!$D96","v":"NA"},null,null,null,null,null,null,null,null,null,null,null,null,null,null,null,null,null,null,null,null,null,null,null,null,null,null,null,null,null,null,null,{"$f":"DonnéesParDéfaut!$D96","v":"NA"}]
["Valeur estimée (pourcentage du coût de construction)",{"$f":"DonnéesParDéfaut!$D97","v":"NA"},null,null,null,null,null,null,null,null,null,null,null,null,null,null,null,null,null,null,null,null,null,null,null,null,null,null,null,null,null,null,null,{"$f":"DonnéesParDéfaut!$D97","v":"NA"}]
["Valeur imposable",{"$f":"IF($B98=\"NA\",\"NA\",$B59*$B99)","v":"NA"},null,null,null,null,null,null,null,null,null,null,null,null,null,null,null,null,null,null,null,null,null,null,null,null,null,null,null,null,null,null,null,{"$f":"IF($B98=\"NA\",\"NA\",$B59*$B99)","v":"NA"}]
["Taxes par MW",{"$f":"DonnéesParDéfaut!$D99","v":5555},null,null,null,null,null,null,null,null,null,null,null,null,null,null,null,null,null,null,null,null,null,null,null,null,null,null,null,null,null,null,null,{"$f":"DonnéesParDéfaut!$D99","v":5555}]
["Impôts locaux",{"$f":"IF($B98=\"NA\",IF(B101=\"NA\",0,$B101*$B11),($B100/1000)*$B98)","v":555500},null,null,{"$f":"DonnéesParDéfaut!$G100","v":1},null,null,null,null,null,null,null,null,null,null,null,null,null,null,null,null,null,null,null,null,null,null,null,null,null,null,null,null,{"$f":"IF($B98=\"NA\",IF(AH101=\"NA\",0,$B101*$B11),($B100/1000)*$B98)","v":555500},{"$f":"DonnéesParDéfaut!$G100","v":1}]
["Taux local de la taxe de vente",{"$f":"DonnéesParDéfaut!$D101","v":0},null,null,{"$f":"DonnéesParDéfaut!$G101","v":1},null,null,null,null,null,null,null,null,null,null,null,null,null,null,null,null,null,null,null,null,null,null,null,null,null,null,null,null,{"$f":"DonnéesParDéfaut!$D101","v":0},{"$f":"DonnéesParDéfaut!$G101","v":1}]
["Paramètres des baux fonciers"]
["Coût de location du terrain (par éolienne)",{"$f":"DonnéesParDéfaut!$D103","v":8250},null,null,null,null,null,null,null,null,null,null,null,null,null,null,null,null,null,null,null,null,null,null,null,null,null,null,null,null,null,null,null,{"$f":"DonnéesParDéfaut!$D103","v":8250}]
["Nombre d'éoliennes",{"$f":"$B13","v":40},null,null,null,null,null,null,null,null,null,null,null,null,null,null,null,null,null,null,null,null,null,null,null,null,null,null,null,null,null,null,null,{"$f":"$B13","v":40}]
["Location du terrain (coût total)",{"$f":"B105*B106","v":330000},null,null,null,null,null,null,null,null,null,null,null,null,null,null,null,null,null,null,null,null,null,null,null,null,null,null,null,null,null,null,null,{"$f":"AH105*AH106","v":330000}]
["Bénéficiaire du paiement du bail (M = ménage/agriculteur, A = autre)",{"$f":"DonnéesParDéfaut!$D105","v":"M"},null,null,{"$f":"DonnéesParDéfaut!$G105","v":1},null,null,null,null,null,null,null,null,null,null,null,null,null,null,null,null,null,null,null,null,null,null,null,null,null,null,null,null,{"$f":"DonnéesParDéfaut!$D105","v":"M"},{"$f":"DonnéesParDéfaut!$G105","v":1}]
["Paramètres de rémunération"]
["Main-d'œuvre en construction","Salaire horaire",null,"Charges salariales",null,null,null,null,null,null,null,null,null,null,null,null,null,null,null,null,null,null,null,null,null,null,null,null,null,null,null,null,null,"Wage per hour",null,"Employer Payroll Overhead"]
["Fondations",{"$f":"DonnéesParDéfaut!$F110","v":17.39154557556369},null,{"$f":"DonnéesParDéfaut!$H110","v":0.33830000000000005},null,null,null,null,null,null,null,null,null,null,null,null,null,null,null,null,null,null,null,null,null,null,null,null,null,null,null,null,null,{"$f":"DonnéesParDéfaut!$F110","v":17.39154557556369},null,{"$f":"DonnéesParDéfaut!$H110","v":0.33830000000000005}]
["Édification",{"$f":"DonnéesParDéfaut!$F111","v":28.667503470831306},null,{"$f":"DonnéesParDéfaut!$H111","v":0.33830000000000005},null,null,null,null,null,null,null,null,null,null,null,null,null,null,null,null,null,null,null,null,null,null,null,null,null,null,null,null,null,{"$f":"DonnéesParDéfaut!$F111","v":28.667503470831306},null,{"$f":"DonnéesParDéfaut!$H111","v":0.33830000000000005}]
["Électricité\n",{"$f":"DonnéesParDéfaut!$F112","v":34.969742839754012},null,{"$f":"DonnéesParDéfaut!$H112","v":0.33830000000000005},null,null,null,null,null,null,null,null,null,null,null,null,null,null,null,null,null,null,null,null,null,null,null,null,null,null,null,null,null,{"$f":"DonnéesParDéfaut!$F112","v":34.969742839754012},null,{"$f":"DonnéesParDéfaut!$H112","v":0.33830000000000005}]
["Gestion / Encadrement\n",{"$f":"DonnéesParDéfaut!$F113","v":33.849832707994224},null,{"$f":"DonnéesParDéfaut!$H113","v":0.33830000000000005},null,null,null,null,null,null,null,null,null,null,null,null,null,null,null,null,null,null,null,null,null,null,null,null,null,null,null,null,null,{"$f":"DonnéesParDéfaut!$F113","v":33.849832707994224},null,{"$f":"DonnéesParDéfaut!$H113","v":0.33830000000000005}]
["Main-d'œuvre en O&M","Salaire horaire",null,"Charges salariales",null,null,null,null,null,null,null,null,null,null,null,null,null,null,null,null,null,null,null,null,null,null,null,null,null,null,null,null,null,"Wage per hour",null,"Employer Payroll Overhead"]
["Salaires du personnel de terrain (c.-à-d. techniciens sur place, etc.)",{"$f":"DonnéesParDéfaut!$F115","v":32.169967510354553},null,{"$f":"DonnéesParDéfaut!$H115","v":0.33830000000000005},null,null,null,null,null,null,null,null,null,null,null,null,null,null,null,null,null,null,null,null,null,null,null,null,null,null,null,null,null,{"$f":"DonnéesParDéfaut!$F115","v":32.169967510354553},null,{"$f":"DonnéesParDéfaut!$H115","v":0.33830000000000005}]
["Administration",{"$f":"DonnéesParDéfaut!$F116","v":21.53082125863661},null,{"$f":"DonnéesParDéfaut!$H116","v":0.33830000000000005},null,null,null,null,null,null,null,null,null,null,null,null,null,null,null,null,null,null,null,null,null,null,null,null,null,null,null,null,null,{"$f":"DonnéesParDéfaut!$F116","v":21.53082125863661},null,{"$f":"DonnéesParDéfaut!$H116","v":0.33830000000000005}]
["Gestion / Encadrement\n",{"$f":"DonnéesParDéfaut!$F117","v":51.318234861227701},null,{"$f":"DonnéesParDéfaut!$H117","v":0.33830000000000005},null,null,null,null,null,null,null,null,null,null,null,null,null,null,null,null,null,null,null,null,null,null,null,null,null,null,null,null,null,{"$f":"DonnéesParDéfaut!$F117","v":51.318234861227701},null,{"$f":"DonnéesParDéfaut!$H117","v":0.33830000000000005}]

{"sheet":"Résultats","index":4,"n_rows":144,"n_cols":37,"rows_kept":144,"cut":false,"hidden":false,"merged":[[40,0,40,4]]}
[" EI2 - ÉOLIEN"]
[{"$f":"CONCATENATE(\"Parc éolien - Résumé des données du projet sur la base des valeurs \",$AE$5)","v":"Parc éolien - Résumé des données du projet sur la base des valeurs par défaut du modèle"}]
["Localisation du projet",null,{"$f":"IF(DonnéesProjet!B9=\"MARÉGION\",RégionPersonnalisée!B4,DonnéesProjet!B9)","v":"Alberta"},null,null,null,null,null,null,null,null,null,null,null,null,null,null,null,null,null,null,null,null,null,null,null,null,null,null,null,{"$f":"D9+D10","v":2050.5204567452565},{"$f":"DonnéesProjet!B20","v":"O"}]
["Année de construction",null,{"$f":"DonnéesProjet!B15","v":2022},null,null,null,null,null,null,null,null,null,null,null,null,null,null,null,null,null,null,null,null,null,null,null,null,null,null,null,{"$f":"DonnéesParDéfaut!E46+DonnéesParDéfaut!E80","v":2050.520456745257}]
["Puissance totale du projet - Puissance installée (MW)",null,{"$f":"DonnéesProjet!B11","v":100},null,null,null,null,null,null,null,null,null,null,null,null,null,null,null,null,null,null,null,null,null,null,null,null,null,null,null,{"$f":"IF(AND(AE3=AE4,AF3=\"O\"),\"par défaut du modèle\",\"révisées par l'utilisateur\")","v":"par défaut du modèle"}]
[]
["Puissance d'une éolienne (kW)",null,{"$f":"DonnéesProjet!B12","v":2500},null,null,null,null,null,null,null,null,null,null,null,null,null,null,null,null,null,null,null,null,null,null,null,null,null,null,null,{"$f":"CONCATENATE(\"EI2-ÉOLIEN_\",DonnéesProjet!B8)","v":"EI2-ÉOLIEN_Projet 1"}]
["Nombre d'éoliennes",null,{"$f":"DonnéesProjet!B13","v":40}]
["Coûts d'installation du projet ($/kW)",null,{"$f":"Calculs!D37/(C5*1000)","v":2025.5204567452568},{"$f":"DonnéesProjet!C57","v":2025.5204567452568},"sans taxes"]
["Coûts annuels d'exploitation et d'entretien ($/kW)",null,{"$f":"Calculs!D93","v":25},{"$f":"DonnéesProjet!C69+DonnéesProjet!C79","v":25},"sans taxes"]
["Valeur monétaire (année de référence)",null,{"$f":"DonnéesProjet!B16","v":2020}]
["Total des coûts d'installation du projet ($/kW)",null,{"$f":"Calculs!D37","v":202552045.67452568}]
["Dépenses locales",null,{"$f":"Calculs!D57","v":36683184.121169366}]
["Total des dépenses annuelles d'exploitation",null,{"$f":"C15+C17","v":22850152.28666475}]
["Coûts directs d'exploitation et d'entretien",null,{"$f":"Calculs!D92","v":2500000}]
["Dépenses locales d'O&M",null,{"$f":"Calculs!G92","v":874304.8845904558}]
["Autres frais annuels",null,{"$f":"Calculs!E92","v":20350152.28666475}]
["Autres dépenses locales",null,{"$f":"Calculs!H92","v":885500}]
["Remboursements des emprunts et des fonds propres ",null,{"$f":"SUM(Calculs!G86:G88)","v":0}]
["Impôts fonciers",null,{"$f":"Calculs!G89","v":555500}]
["Location de terrain",null,{"$f":"Calculs!G90","v":330000}]
[]
["Retombées économiques locales - Résumé des résultats",null,null,null,null,null,null,null,null,null,null,null,null,null,null,null,null,null,null,null,null,null,null,null,null,null,null,null,null,null,"Retombées économiques locales - Phase de construction - # d'emplois créés"]
[null,"Emplois","Revenus","Extrant","Valeur ajoutée",null,null,null,null,null,null,null,null,null,null,null,null,null,null,null,null,null,null,null,null,null,null,null,null,null,"Pendant la phase construction","EMPLOIS",null,null,"Revenus","Extrants","Valeur ajoutée"]
["Durant la construction",null,null,null,null,null,null,null,null,null,null,null,null,null,null,null,null,null,null,null,null,null,null,null,null,null,null,null,null,null,"Retombées induites",{"$f":"B31","v":45.510615183925971},null,"Retombées induites",{"$f":"C31","v":2.3905487705933388},9.4159182793552496,5.850939787306304]
["Retombées du développement du projet et à la main d'œuvre sur site",null,null,null,null,null,null,null,null,null,null,null,null,null,null,null,null,null,null,null,null,null,null,null,null,null,null,null,null,null,"Retombées dues la chaine d'approvisionnement",{"$f":"B30","v":187.00667646540444},null,"Retombées dues la chaine d'approvisionnement",{"$f":"C30","v":14.419541732306202},49.436916811453649,13.708308090508755]
["Travaux de construction et d'interconnexion",{"$f":"Calculs!AH42","v":57.939713717356504},{"$f":"Calculs!AI42","v":4.3020851631095489},null,null,null,null,null,null,null,null,null,null,null,null,null,null,null,null,null,null,null,null,null,null,null,null,null,null,null,"Retombées dues au développement de projet et de la main d'œuvre sur site",{"$f":"B29","v":63.198987058612772},null,"Retombées dues au développement de projet et de la main d'œuvre sur site",{"$f":"C29","v":4.7822846118848936},5.4182538112562124,11.898176099627831]
["Services relatifs à la construction",{"$f":"Calculs!AH43","v":5.2592733412562662},{"$f":"Calculs!AI43","v":0.48019944877534443},null,null,null,null,null,null,null,null,null,null,null,null,null,null,null,null,null,null,null,null,null,null,null,null,null,null,null,"Total des retombées locales",{"$f":"B32","v":295.71627870794316},null,"Total des retombées locales",{"$f":"C32","v":21.592375114784435},{"$f":"D32","v":64.271088902065102},{"$f":"E32","v":31.457423977442893}]
["Total des retombées du développement du projet et de la main-d'œuvre sur site ",{"$f":"Calculs!AH41","v":63.198987058612772},{"$f":"Calculs!AI41","v":4.7822846118848936},{"$f":"Calculs!AJ41","v":5.4182538112562124},{"$f":"Calculs!AK41","v":11.898176099627831}]
["Retombées locales - chaîne d'approvisionnement",{"$f":"Calculs!AH44","v":187.00667646540444},{"$f":"Calculs!AI44","v":14.419541732306202},{"$f":"Calculs!AJ44","v":49.436916811453649},{"$f":"Calculs!AK44","v":13.708308090508755},null,null,null,null,null,null,null,null,null,null,null,null,null,null,null,null,null,null,null,null,null,null,null,null,null,"Retombées économiques locales - Phase d'O&M - # d'emplois créés"]
["Retombées induites",{"$f":"Calculs!AH45","v":45.510615183925971},{"$f":"Calculs!AI45","v":2.3905487705933388},{"$f":"Calculs!AJ45","v":9.4159182793552496},{"$f":"Calculs!AK45","v":5.850939787306304},null,null,null,null,null,null,null,null,null,null,null,null,null,null,null,null,null,null,null,null,null,null,null,null,null,"During operating years (annual)","EMPLOIS",null,null,"Revenus","Extrants","Valeur ajoutée"]
["Total des retombées locales",{"$f":"Calculs!AH46","v":295.71627870794316},{"$f":"Calculs!AI46","v":21.592375114784435},{"$f":"Calculs!AJ46","v":64.271088902065102},{"$f":"Calculs!AK46","v":31.457423977442893},null,null,null,null,null,null,null,null,null,null,null,null,null,null,null,null,null,null,null,null,null,null,null,null,null,"Retombées induites",{"$f":"B37","v":2.2846882857498851},null,"Retombées induites",{"$f":"C37","v":0.12006962929745907},0.47233224728258955,0.29339760830201722]
[null,null,null,null,null,null,null,null,null,null,null,null,null,null,null,null,null,null,null,null,null,null,null,null,null,null,null,null,null,null,"Revenus locaux et retombées dues la chaine d'approvisionnement",{"$f":"B36","v":10.628753097976187},null,"Revenus locaux et retombées dues la chaine d'approvisionnement",{"$f":"C36","v":0.7185354654589805},{"$f":"D36","v":2.2237716481410619},{"$f":"E36","v":1.2389170521292281}]
["Durant les années d'exploitation (ANNUELLEMENT)",null,null,null,null,null,null,null,null,null,null,null,null,null,null,null,null,null,null,null,null,null,null,null,null,null,null,null,null,null,"Retombées dues à la main d'œuvre sur site",{"$f":"B35","v":6},null,"Retombées dues à la main d'œuvre sur site",{"$f":"C35","v":0.40952183620108884},0.40952183620108884,0.40952183620108884]
["Retombées de la main-d'œuvre sur site",{"$f":"Calculs!AH50","v":6},{"$f":"Calculs!AI50","v":0.40952183620108884},{"$f":"Calculs!AJ50","v":0.40952183620108884},{"$f":"Calculs!AK50","v":0.40952183620108884},null,null,null,null,null,null,null,null,null,null,null,null,null,null,null,null,null,null,null,null,null,null,null,null,null,"Total des retombées locales",{"$f":"B38","v":18.913441383726074},null,"Total des retombées locales",{"$f":"C38","v":1.2481269309575285},{"$f":"D38","v":3.1056257316247402},{"$f":"E38","v":1.9418364966323343}]
["Retombées locales - revenus et chaîne d'approvisionnement",{"$f":"Calculs!AH51","v":10.628753097976187},{"$f":"Calculs!AI51","v":0.7185354654589805},{"$f":"Calculs!AJ51","v":2.2237716481410619},{"$f":"Calculs!AK51","v":1.2389170521292281}]
["Retombées induites",{"$f":"Calculs!AH52","v":2.2846882857498851},{"$f":"Calculs!AI52","v":0.12006962929745907},{"$f":"Calculs!AJ52","v":0.47233224728258955},{"$f":"Calculs!AK52","v":0.29339760830201722}]
["Total des retombées locales",{"$f":"Calculs!AH53","v":18.913441383726074},{"$f":"Calculs!AI53","v":1.2481269309575285},{"$f":"Calculs!AJ53","v":3.1056257316247402},{"$f":"Calculs!AK53","v":1.9418364966323343}]
["Remarques:"]
[{"$f":"CONCATENATE(\"      - Les revenus, les extrants et la valeur ajoutées sont exprimées en millions de dollars de \", DonnéesProjet!B16,\".\")","v":"      - Les revenus, les extrants et la valeur ajoutées sont exprimées en millions de dollars de 2020."}]
["- Les emplois de construction et d'exploitation sont des équivalents temps plein pendant un an (1 ETP = 2 080 heures). Font partie des travailleurs du parc éolien les techniciens de terrain, l'administration et la gestion. Les retombées économiques pendant les années d'exploitation  sont celles qui découlent de l'exploitation et des autres dépenses du parc éolien. L'analyse n'inclut pas les retombées des dépenses liées aux «profits» du parc éolien et ne prend pas en compte les abattements fiscaux, sauf indication contraire. Les totaux peuvent ne pas correspondre à la somme des composantes en raison des arrondis.  "]
[{"$f":"CONCATENATE(\"     - Les résultats sont établis à partir des valeurs \",AE5,\" .\")","v":"     - Les résultats sont établis à partir des valeurs par défaut du modèle ."}]
[]
[]
[]
[]
["Parc éolien - Coûts de construction détaillés",null,{"$f":"Calculs!E1","v":"Alberta"}]
[]
["Coûts de l'équipement",null,"Cost","Local Share"]
["Turbines éoliennes et autres équipements (à l'exclusion des pales et des tours)\n"]
["Pales",null,{"$f":"Calculs!AC21","v":90235535.824108422},{"$f":"Calculs!AD21","v":0}]
["Tours",null,{"$f":"Calculs!AC22","v":21125376.279891599},{"$f":"Calculs!AD22","v":0}]
["Transport",null,{"$f":"Calculs!AC23","v":23388809.452737126},{"$f":"Calculs!AD23","v":0}]
["Total pour l'équipement",null,{"$f":"Calculs!AC24","v":16145823.299631439},{"$f":"Calculs!AD24","v":0}]
["Systèmes Auxilliaires",null,{"$f":"Calculs!AC25","v":150895544.8563686}]
["Matériaux"]
["Construction (béton, armature, équipement, voies d'accès et préparation du site)"]
["Transformateur",null,{"$f":"Calculs!AC7","v":21804406.524476796},{"$f":"Calculs!AD7","v":0.9}]
["Électricité (câble de dérivation, fil)\n",null,{"$f":"Calculs!AC8","v":2466530.4197062631},{"$f":"Calculs!AD8","v":0}]
["Prolongement de la ligne HT",null,{"$f":"Calculs!AC9","v":2599889.7286412967},{"$f":"Calculs!AD9","v":1}]
["Sous-total pour les matériaux",null,{"$f":"Calculs!AC10","v":4749131.1675761305},{"$f":"Calculs!AD10","v":0.7}]
["Main-d'œuvre",null,{"$f":"Calculs!AC11","v":31619957.840400487}]
["Fondations"]
["Édification",null,{"$f":"Calculs!AC13","v":1105050.8286339508},{"$f":"Calculs!AD13","v":0.95}]
["Électricité\n",null,{"$f":"Calculs!AC14","v":1821520.0211889176},{"$f":"Calculs!AD14","v":0.75}]
["Gestion / Encadrement\n",null,{"$f":"Calculs!AC15","v":2444157.5619438435},{"$f":"Calculs!AD15","v":0.7}]
["Divers",null,{"$f":"Calculs!AC16","v":1341768.8448233332},{"$f":"Calculs!AD16","v":0.1}]
["Sous-total pour la main-d'œuvre",null,{"$f":"Calculs!AC17","v":7696049.7238209052},{"$f":"Calculs!AD17","v":0.5}]
["Coûts de développement et autres",null,{"$f":"Calculs!AC18","v":14408546.98041095}]
["Sous-station/interconnexion HT"]
["Matériel"]
["Main-d'œuvre",null,{"$f":"Calculs!AC28","v":1498533.4877443062},{"$f":"Calculs!AD28","v":0.9}]
["Ingénierie",null,{"$f":"Calculs!AC29","v":459030.33741939464},{"$f":"Calculs!AD29","v":0.1}]
["Services juridiques",null,{"$f":"Calculs!AC30","v":2039128.9845455212},{"$f":"Calculs!AD30","v":0}]
["Servitudes foncières",null,{"$f":"Calculs!AC31","v":1111325.296577309},{"$f":"Calculs!AD31","v":1}]
["Permis/certificat d'implantation",null,{"$f":"Calculs!AC32","v":0},{"$f":"Calculs!AD32","v":1}]
["Sous-total de coûts de développement et autres",null,{"$f":"Calculs!AC33","v":519977.89105910808},{"$f":"Calculs!AD33","v":1}]
["Total systèmes auxilliaires",null,{"$f":"Calculs!AC34","v":5627995.9973456394}]
["Sous-total (ensemble des coûts sans les taxes)\n",null,{"$f":"C78+C69+C62","v":51656500.818157077}]
["Taxe de vente (achats de matériel et d'équipement)",null,{"$f":"Calculs!AC36","v":0},{"$f":"Calculs!AD36","v":1}]
["Total",null,{"$f":"Calculs!AC37","v":202552045.67452568}]
[]
["Parc éolien - Coûts d'opération et de maintenance détaillés"]
[]
["Main-d'œuvre"]
["Personnel"]
["Salaires du personnel de terrain (c.-à-d. techniciens sur place, etc.)",null,{"$f":"Calculs!AC43","v":358201.52175897441},{"$f":"Calculs!AD43","v":1}]
["Administration",null,{"$f":"Calculs!AC44","v":59934.572028101422},{"$f":"Calculs!AD44","v":1}]
["Gestion",null,{"$f":"Calculs!AC45","v":142852.72292674455},{"$f":"Calculs!AD45","v":1}]
["Sous-total pour la main-d'œuvre et le personnel",null,{"$f":"Calculs!AC46","v":560988.81671382044}]
["Matériel et services"]
["Véhicules",null,{"$f":"Calculs!AC51","v":55392.406321559203},{"$f":"Calculs!AD51","v":1}]
["Entretien du site et services divers",null,{"$f":"Calculs!AC52","v":21603.038465408088},{"$f":"Calculs!AD52","v":0.8}]
["Redevances, permis, autorisations",null,{"$f":"Calculs!AC53","v":10801.519232704044},{"$f":"Calculs!AD53","v":1}]
["Services",null,{"$f":"Calculs!AC54","v":43206.076930816176},{"$f":"Calculs!AD54","v":1}]
["Assurances",null,{"$f":"Calculs!AC55","v":415443.04741169396},{"$f":"Calculs!AD55","v":0}]
["Carburant (pour les véhicules à moteur)",null,{"$f":"Calculs!AC56","v":21603.038465408088},{"$f":"Calculs!AD56","v":1}]
["Produits, outils et fournitures diverses",null,{"$f":"Calculs!AC57","v":140419.75002515258},{"$f":"Calculs!AD57","v":1}]
["Inventaire des pièces de rechange, de l'équipement et des pièces détachées",null,{"$f":"Calculs!AC58","v":1230542.3064334374},{"$f":"Calculs!AD58","v":0.02}]
["Sous-total pour le matériel et les services",null,{"$f":"Calculs!AC59","v":1939011.1832861796}]
["Taxe de vente (achats de matériel et d'équipement)",null,{"$f":"Calculs!AC60","v":0},{"$f":"Calculs!AD60","v":1}]
["Autres impôts et frais",null,{"$f":"Calculs!AC61","v":0},{"$f":"Calculs!AD61","v":1}]
["Total (taxes et autres frais inclus)",null,{"$f":"Calculs!AC62","v":2500000}]
["Paiement de la dette (moyenne annuelle)",null,{"$f":"Calculs!AC63","v":14706314.830296485},{"$f":"Calculs!AD63","v":0}]
["Paiement du capital - Particuliers ",null,{"$f":"Calculs!AC64","v":0},{"$f":"Calculs!AD64","v":1}]
["Paiement du capital - Entreprises",null,{"$f":"Calculs!AC65","v":4758337.4563682675},{"$f":"Calculs!AD65","v":0}]
["Taxes foncières",null,{"$f":"Calculs!AC66","v":555500},{"$f":"Calculs!AD66","v":1}]
["Location de terrain",null,{"$f":"Calculs!AC67","v":330000},{"$f":"Calculs!AD67","v":1}]
["Total des coûts annuels d'operation et de maintenance",null,{"$f":"Calculs!AC68","v":22850152.28666475}]
[]
["Parc éolien - Autres paramètres"]
[null,null,null,"Local share"]
["Paramètres financiers"]
["Financement par emprunt"]
["Pourcentage de financement",null,{"$f":"Calculs!AC74","v":0.8},{"$f":"Calculs!AD74","v":0}]
["Années de financement (échéance)",null,{"$f":"Calculs!AC75","v":20}]
["Taux d'intérêt",null,{"$f":"Calculs!AC76","v":6.5000000000000002E-2}]
["Financement en fonds propres "]
["Pourcentage de fonds propres",null,{"$f":"Calculs!AC78","v":0.19999999999999996}]
["Investisseurs particuliers (pourcentage du capital total)",null,{"$f":"Calculs!AC79","v":0},{"$f":"Calculs!AD79","v":0}]
["Sociétés d'investissement (pourcentage du capital total)",null,{"$f":"Calculs!AC80","v":1},{"$f":"Calculs!AD80","v":0}]
["Rendement des fonds propres (taux d'intérêt annuel)",null,{"$f":"Calculs!AC81","v":0.1}]
["Durée de remboursement (années)",null,{"$f":"Calculs!AC82","v":20}]
["Paramètres fiscaux"]
["Taux local de l'impôt foncier (taux par mille - $/1 000 $)",null,{"$f":"Calculs!AC84","v":"NA"}]
["Valeur estimée (pourcentage du coût de construction)",null,{"$f":"Calculs!AC85","v":"NA"}]
["Valeur imposable",null,{"$f":"Calculs!AC86","v":"NA"}]
["Taxes par MW",null,{"$f":"Calculs!AC87","v":5555}]
["Impôts locaux",null,{"$f":"Calculs!AC88","v":555500},{"$f":"Calculs!AD88","v":1}]
["Taux local de la taxe de vente",null,{"$f":"Calculs!AC89","v":0},{"$f":"Calculs!AD89","v":1}]
["Paramètres des baux fonciers"]
["Coût de location du terrain (par éolienne)",null,{"$f":"Calculs!AC91","v":8250}]
["Location du terrain (coût total)",null,{"$f":"Calculs!AC92","v":330000}]
["Bénéficiaire du paiement du bail (M = ménage/agriculteur, A = autre)",null,{"$f":"Calculs!AC93","v":"M"},{"$f":"Calculs!AD93","v":0}]
["Paramètres de rémunération"]
["Main-d'œuvre en construction",null,"Salaire horaire","Charges salariales"]
["Fondations",null,{"$f":"Calculs!AC96","v":17.39154557556369},{"$f":"Calculs!AE96","v":0.33830000000000005}]
["Édification",null,{"$f":"Calculs!AC97","v":28.667503470831306},{"$f":"Calculs!AE97","v":0.33830000000000005}]
["Électricité\n",null,{"$f":"Calculs!AC98","v":34.969742839754012},{"$f":"Calculs!AE98","v":0.33830000000000005}]
["Gestion / Encadrement\n",null,{"$f":"Calculs!AC99","v":33.849832707994224},{"$f":"Calculs!AE99","v":0.33830000000000005}]
["Main-d'œuvre en O&M",null,"Salaire horaire","Charges salariales"]
["Salaires du personnel de terrain (c.-à-d. techniciens sur place, etc.)",null,{"$f":"Calculs!AC101","v":32.169967510354553},{"$f":"Calculs!AE101","v":0.33830000000000005}]
["Administration",null,{"$f":"Calculs!AC102","v":21.53082125863661},{"$f":"Calculs!AE102","v":0.33830000000000005}]
["Gestion / Encadrement\n",null,{"$f":"Calculs!AC103","v":51.318234861227701},{"$f":"Calculs!AE103","v":0.33830000000000005}]

{"sheet":"RégionPersonnalisée","index":5,"n_rows":209,"n_cols":6,"rows_kept":209,"cut":false,"hidden":false,"merged":[[1,0,1,4],[6,4,7,5]]}
["Multiplicateurs pour analyse Input-Output d'une région personnalisée"]
["Utilisez cette feuille de calcul lorsque vous effectuez une analyse de région personnalisée (sélectionnez \"MAREGION\" dans la feuille de calcul des données du projet).\n1. Entrez le nom de la région, l'année des multiplicateurs et la province ou le territoire où la région est située.\n2. Entrez les multiplicateurs et le modèle de dépenses de consommation personnelle de cette région.\n3. Enfin, vous pouvez revenir à la feuille de calcul données du projet pour mettre à jour les différentes valeurs."]
[]
["MARÉGION (Nom)",null,"Année des données",null,""]
["Province ou Territoire (Nom)","Canada"]
[]
["Multiplicateurs directs d'emplois ",null,null,null,"Dépenses personnelles de consommation (DPC)"]
["Emplois par million de dollars de production"]
["Agriculture",0,null,null,0]
["Exploitation minière",0,null,null,0]
["Construction",0,null,null,0]
["Secteur manufacturier",0,null,null,0]
["Fabrication de produits métalliques",0,null,null,0]
["Machinerie",0,null,null,0]
["Équipements électriques",0,null,null,0]
["TCSP",0,null,null,0]
["Commerce de gros",0,null,null,0]
["Commerce de détail",0,null,null,0]
["FAI",0,null,null,0]
["Services divers",0,null,null,0]
["Services professionels",0,null,null,0]
["Gouvernement",0,null,null,0]
[null,null,null,null,{"$f":"SUM(E9:E22)","v":0},"Total"]
["Multiplicateurs indirects d'emplois "]
["Emplois par million de dollars de production"]
["Agriculture",0]
["Exploitation minière",0]
["Construction",0]
["Secteur manufacturier",0]
["Fabrication de produits métalliques",0]
["Machinerie",0]
["Équipements électriques",0]
["TCSP",0]
["Commerce de gros",0]
["Commerce de détail",0]
["FAI",0]
["Services divers",0]
["Services professionels",0]
["Gouvernement",0]
[]
["Multiplicateurs induits d'emplois "]
["Emplois par million de dollars de production"]
["Agriculture",0]
["Exploitation minière",0]
["Construction",0]
["Secteur manufacturier",0]
["Fabrication de produits métalliques",0]
["Machinerie",0]
["Équipements électriques",0]
["TCSP",0]
["Commerce de gros",0]
["Commerce de détail",0]
["FAI",0]
["Services divers",0]
["Services professionels",0]
["Gouvernement",0]
[]
["Multiplicateurs directs de revenus "]
["Revenus par  dollars de production"]
["Agriculture",0]
["Exploitation minière",0]
["Construction",0]
["Secteur manufacturier",0]
["Fabrication de produits métalliques",0]
["Machinerie",0]
["Équipements électriques",0]
["TCSP",0]
["Commerce de gros",0]
["Commerce de détail",0]
["FAI",0]
["Services divers",0]
["Services professionels",0]
["Gouvernement",0]
[]
["Multiplicateurs indirects de revenus "]
["Revenus par  dollars de production"]
["Agriculture",0]
["Exploitation minière",0]
["Construction",0]
["Secteur manufacturier",0]
["Fabrication de produits métalliques",0]
["Machinerie",0]
["Équipements électriques",0]
["TCSP",0]
["Commerce de gros",0]
["Commerce de détail",0]
["FAI",0]
["Services divers",0]
["Services professionels",0]
["Gouvernement",0]
[]
["Multiplicateurs induits de revenus "]
["Revenus par  dollars de production"]
["Agriculture",0]
["Exploitation minière",0]
["Construction",0]
["Secteur manufacturier",0]
["Fabrication de produits métalliques",0]
["Machinerie",0]
["Équipements électriques",0]
["TCSP",0]
["Commerce de gros",0]
["Commerce de détail",0]
["FAI",0]
["Services divers",0]
["Services professionels",0]
["Gouvernement",0]
[]
["Multiplicateurs directs de production "]
["Production par  dollars de production"]
["Agriculture",0]
["Exploitation minière",0]
["Construction",0]
["Secteur manufacturier",0]
["Fabrication de produits métalliques",0]
["Machinerie",0]
["Équipements électriques",0]
["TCSP",0]
["Commerce de gros",0]
["Commerce de détail",0]
["FAI",0]
["Services divers",0]
["Services professionels",0]
["Gouvernement",0]
[]
["Multiplicateurs indirects de production "]
["Production par  dollars de production"]
["Agriculture",0]
["Exploitation minière",0]
["Construction",0]
["Secteur manufacturier",0]
["Fabrication de produits métalliques",0]
["Machinerie",0]
["Équipements électriques",0]
["TCSP",0]
["Commerce de gros",0]
["Commerce de détail",0]
["FAI",0]
["Services divers",0]
["Services professionels",0]
["Gouvernement",0]
[]
["Multiplicateurs induits de production "]
["Production par  dollars de production"]
["Agriculture",0]
["Exploitation minière",0]
["Construction",0]
["Secteur manufacturier",0]
["Fabrication de produits métalliques",0]
["Machinerie",0]
["Équipements électriques",0]
["TCSP",0]
["Commerce de gros",0]
["Commerce de détail",0]
["FAI",0]
["Services divers",0]
["Services professionels",0]
["Gouvernement",0]
[]
["Multiplicateurs directs de valeur ajoutée "]
["Valeur ajoutée par  dollars de production"]
["Agriculture",0]
["Exploitation minière",0]
["Construction",0]
["Secteur manufacturier",0]
["Fabrication de produits métalliques",0]
["Machinerie",0]
["Équipements électriques",0]
["TCSP",0]
["Commerce de gros",0]
["Commerce de détail",0]
["FAI",0]
["Services divers",0]
["Services professionels",0]
["Gouvernement",0]
[]
["Multiplicateurs indirects de valeur ajoutée "]
["Valeur ajoutée par  dollars de production"]
["Agriculture",0]
["Exploitation minière",0]
["Construction",0]
["Secteur manufacturier",0]
["Fabrication de produits métalliques",0]
["Machinerie",0]
["Équipements électriques",0]
["TCSP",0]
["Commerce de gros",0]
["Commerce de détail",0]
["FAI",0]
["Services divers",0]
["Services professionels",0]
["Gouvernement",0]
[]
["Multiplicateurs induits de valeur ajoutée "]
["Valeur ajoutée par  dollars de production"]
["Agriculture",0]
["Exploitation minière",0]
["Construction",0]
["Secteur manufacturier",0]
["Fabrication de produits métalliques",0]
["Machinerie",0]
["Équipements électriques",0]
["TCSP",0]
["Commerce de gros",0]
["Commerce de détail",0]
["FAI",0]
["Services divers",0]
["Services professionels",0]
["Gouvernement",0]

{"sheet":"DonnéesParDéfaut","index":6,"n_rows":158,"n_cols":48,"rows_kept":158,"cut":false,"hidden":false,"merged":[[0,0,16,1]]}
["*** AVERTISSEMENT ***\n\nCette feuille de calcul contient des données et des formules qui font partie intégrante du modèle EI2. \nBien que ces données et formules soient consultables pour examen, elles ne doivent pas être modifiées.\nToute modification des données ou des formules affectera l'analyse et pourrait invalider les résultats du modèle.\n\nPour les visualiser, faites simplement défiler les colonnes vers la droite.",null,null,null,null,null,null,null,null,null,null,null,null,null,null,null,null,null,"Changement annuel moyen"]
[null,null,null,null,null,null,null,null,null,null,"Défaut",null,null,null,null,null,null,null,-0.01]
[null,null,null,null,null,null,null,"Const Emplois/",{"$f":"E5","v":100},"O&M Emplois/",{"$f":"E5","v":100},"MW",null,null,"Coût moyen du projet (construction / installation) par kW",null,null,{"$f":"IF(Year_of_Construction<O4,O5,HLOOKUP(Year_of_Construction,O4:AH5,2,FALSE))","v":1999.8}]
[null,null,null,"Nombre de turbines","MW","Total Installed Cost",null,"Fondation",{"$f":"I$3*AM30","v":22.825865950493196},"Tech. Terrain",{"$f":"K$3*AP56","v":4},null,null,null,2016,2017,2018,2019,2020,2021,2022,2023,2024,2025,{"$f":"X4+1","v":2026},2027,2028,2029,2030,2031,2032,2033,2034,2035,2036,2037,2038,2039,2040]
[null,null,null,{"$f":"ROUNDUP(DonnéesProjet!B11*1000/DonnéesProjet!B12,0)","v":40},{"$f":"DonnéesProjet!B11","v":100},{"$f":"R8","v":2025.2762431107647},null,"Édification",{"$f":"I$3*AM31","v":22.825865950493196},"Admin",{"$f":"K$3*AP57","v":1},null,null,null,2020,2020,2020,2020,2020,2020,{"$f":"T5*(1+$S2)","v":1999.8},1979.8019999999999,1960.00398,1940.4039401999999,1920.9999007979998,1901.7899017900197,1882.7720027721195,1863.9442827443984,1845.3048399169543,1827,1827,1827,1827,1827,1827,1827,1827,1827,1827]
[null,null,null,null,null,null,null,"Électricité",25.108452545542516,"Gestion",{"$f":"K$3*AP58","v":1}]
[null,null,null,"Construction",null," User",null,"Gestion / Encadrement",14.239815553471088,"Total",{"$f":"SUM(K4:K6)","v":6},null,null,null,null,null,"Ajustement loc. const.",{"$f":"VLOOKUP(DonnéesProjet!B9,Multiplicateurs!S8:T22,2,FALSE)","v":1.0979511095684147},null,null,null,null,null,null,null,null,null,null,null,null,null,null,null,null,null,null,"Taille moyenne turbine (kW)",null,null,"Ajustement coût O&M"]
[null,null,null,"Coût par kW","Coût du projet","Coût O&M","Coût O&M par défaut","kW par turbine",{"$f":"SUM(I4:I7)","v":85},null,null,null,null,null,null,null,"Coût de construction / installation ajusté (par kW)",{"$f":"Y46","v":2025.2762431107647},null,null,null,null,null,null,null,null,null,null,null,null,null,null,null,null,null,null,null,1500,null,"<=20 MW",{"$f":"25+Z119","v":25.500472895138206},"par KW"]
[null,null,null,{"$f":"DonnéesProjet!B18","v":2025.2762431107647},{"$f":"D9*DonnéesProjet!B11*1000","v":202527624.31107646},{"$f":"DonnéesProjet!B19","v":25},25,{"$f":"DonnéesProjet!B12","v":2500},null,null,null,null,null,null,null,null,null,null,null,null,null,null,null,null,null,null,null,null,null,null,null,null,null,null,null,null,null,null,null,"100 MW",{"$f":"20+Z119","v":20.500472895138206},"par KW"]
[]
[null,null,"Données projet"]
[null,null,null,null,null,null,null,"Très petite","Petite","Moyenne","Grande"]
[null,null,null,null,null,null,null,30000,100000,300000,400000,null,{"$f":"DonnéesProjet!B10","v":0}]
[null,null,"Projet éolien - Coûts de construction","Coût","Coût ","Pourcentage","Province","Région","Région","Région","Région",null,null,null,30000,null,null,null,null,null,null,"Ajustement de l'allocation des coûts de construction"]
[null,null,null,null,"Par kW","du coût total","Part locale","Part locale","Part locale","Part locale","Part locale",null,null,null,100000,null,null,300000,null,null,400000,0.99970000000000003]
[null,null,"Systèmes Auxilliaires"]
[null,null,"Matériaux",null,null,null,null,null,null,null,null,null,"Ajustement des parts locales pour région personnnalisée",null,null,null,null,null,null,null,null,null,"Pourcentage","Moy.","ajustement localisation","Pourcentage"]
[null,null,"Construction (béton, armature, équipement, voies d'accès et préparation du site)",{"$f":"(E$9-(D$29-D$28))*V18","v":21804406.524476796},{"$f":"F18*D$9","v":218.04406524476795},{"$f":"D18/E$9","v":0.10766139482772913},{"$f":"IF(DonnéesProjet!$B$9=\"Canada\",1,0.9)","v":0.9},3.8277680140597542E-2,0.12147627416520212,0.9,0.9,null,{"$f":"(M$13-H$13)/(I$13-H$13)","v":-0.42857142857142855},{"$f":"I18-H18","v":8.3198594024604583E-2},{"$f":"H18+(N18*M$18)","v":2.621139844338434E-3},{"$f":"(M$13-I$13)/(J$13-I$13)","v":-0.5},{"$f":"J18-I18","v":0.7785237258347979},{"$f":"I18+(P$18*Q18)","v":-0.26778558875219682},{"$f":"IF((M$13-J$13)/(K$13-J$13)>1,1,(M$13-J$13)/(K$13-J$13))","v":-3},{"$f":"K18-J18","v":0},{"$f":"J18+(S$18*T18)","v":0.9},{"$f":"AU18*$V$15","v":0.11135200253660497},8.8059999999999999E-2,{"$f":"W18*R$3","v":176.10238799999999},{"$f":"X18","v":176.10238799999999},{"$f":"Y18/Y$46","v":8.6952280509404442E-2},null,null,null,null,null,null,null,null,null,null,null,null,null,null,null,null,null,null,null,null,0.11138541816205359,{"$f":"AU18/AU$47","v":5.7946213065609528E-2}]
[null,null,"Transformateur",{"$f":"(E$9-(D$29-D$28))*V19","v":2466530.4197062631},{"$f":"F19*D$9","v":24.665304197062632},{"$f":"D19/E$9","v":1.2178735755660398E-2},{"$f":"IF(DonnéesProjet!$B$9=\"Canada\",1,0)","v":0},0,0,0,0,null,null,{"$f":"I19-H19","v":0},{"$f":"H19+(N19*M$18)","v":0},null,{"$f":"J19-I19","v":0},{"$f":"I19+(P$18*Q19)","v":0},null,{"$f":"K19-J19","v":0},{"$f":"J19+(S$18*T19)","v":0},{"$f":"AU19*$V$15","v":1.259622E-2},2.2260000000000002E-2,{"$f":"W19*R$3","v":44.515548000000003},{"$f":"X19","v":44.515548000000003},{"$f":"Y19/Y$46","v":2.1979988236876483E-2},null,null,null,null,null,null,null,null,null,null,null,null,null,null,null,null,null,null,null,null,1.26E-2,{"$f":"AU19/AU$47","v":6.5549180195600826E-3}]
[null,null,"Électricité (câble de dérivation, fil)\n",{"$f":"(E$9-(D$29-D$28))*V20","v":2599889.7286412967},{"$f":"F20*D$9","v":25.998897286412969},{"$f":"D20/E$9","v":1.2837210417517873E-2},{"$f":"IF(DonnéesProjet!$B$9=\"Canada\",1,1)","v":1},0,0,0,1,null,null,{"$f":"I20-H20","v":0},{"$f":"H20+(N20*M$18)","v":0},null,{"$f":"J20-I20","v":0},{"$f":"I20+(P$18*Q20)","v":0},null,{"$f":"K20-J20","v":1},{"$f":"J20+(S$18*T20)","v":-3},1.3277267020937896E-2,1.0500000000000001E-2,20.997900000000001,{"$f":"X20","v":20.997900000000001},1.0367918979658719E-2,null,null,null,null,null,null,null,null,null,null,null,null,null,null,null,null,null,null,null,null,1.3281251396356802E-2,{"$f":"AU20/AU$47","v":6.9093265158957709E-3}]
[null,null,"Prolongement de la ligne HT",{"$f":"(E$9-(D$29-D$28))*V21","v":4749131.1675761305},{"$f":"F21*D$9","v":47.491311675761303},{"$f":"D21/E$9","v":2.3449300724930268E-2},{"$f":"IF(DonnéesProjet!$B$9=\"Canada\",1,0.7)","v":0.7},0,0,0,0.7,null,null,{"$f":"I21-H21","v":0},{"$f":"H21+(N21*M$18)","v":0},null,{"$f":"J21-I21","v":0},{"$f":"I21+(P$18*Q21)","v":0},null,{"$f":"K21-J21","v":0.7},{"$f":"J21+(S$18*T21)","v":-2.0999999999999996},2.4253137329143443E-2,1.9179999999999999E-2,38.356164,{"$f":"X21","v":38.356164},1.8938732002843257E-2,null,"Nombre moyen d'emplois en fonction de la capacité installée",null,null,null,null,null,null,null,null,null,null,{"$f":"IF(E5<20,20,E5)","v":100},null,null,null,null,null,null,null,2.4260415453779577E-2,{"$f":"AU21/AU$47","v":1.2621034477777274E-2}]
[null,null,"Sous-total pour les matériaux",{"$f":"SUM(D18:D21)","v":31619957.840400487},{"$f":"F22*D$9","v":316.19957840400491},{"$f":"D22/E$9","v":0.15612664172583768},null,null,null,null,null,null,null,null,null,null,null,null,null,null,null,0.16147862688668629,0.14000000000000001,279.97200000000004,{"$f":"X22","v":279.97200000000004},0.13823891972878291,null,null,20,30,60,75,100,150,200,250,300,"MW",null,null,"Défaut","Révisé",null,null,null,null,{"$f":"SUM(AU18:AU21)","v":0.16152708501218996},{"$f":"AU22/AU$47","v":8.4031492078842654E-2}]
[null,null,"Main-d'œuvre",null,null,null,null,null,null,null,null,null,null,null,null,null,null,null,null,null,null,null,null,null,null,null,null,null,55,60,75,82,85,110,135,155,185,"Emplois Const.",null,"Total Emplois","Emplois locaux","Emplois locaux"]
[null,null,"Fondations",{"$f":"AN30","v":1105050.8286339508},{"$f":"D24/(E$5*1000)","v":11.050508286339507},{"$f":"D24/E$9","v":5.4562968009570154E-3},{"$f":"IF(DonnéesProjet!$B$9=\"Canada\",1,0.95)","v":0.95},1.7204301075268817E-2,9.4623655913978491E-2,0.28673835125448033,{"$f":"G24","v":0.95},null,null,{"$f":"I24-H24","v":7.7419354838709681E-2},{"$f":"H24+(N24*M$18)","v":-1.5975422427035327E-2},null,{"$f":"J24-I24","v":0.19211469534050185},{"$f":"I24+(P$18*Q24)","v":-1.4336917562724344E-3},null,{"$f":"K24-J24","v":0.66326164874551963},{"$f":"J24+(S$18*T24)","v":-1.7030465949820786},null,3.0240000000000006E-2,60.473952000000011,{"$f":"X24*R$7","v":66.397442698387067},3.2784388265179348E-2,{"$f":"Z24/Z$29","v":0.27027027027027029},"Fondation",{"$f":"(AC$23-AC$27)*($AA24/($AA$24+$AA$25+$AA$26))","v":14.769677967966187},{"$f":"(AD$23-AD$27)*($AA24/($AA$24+$AA$25+$AA$26))","v":16.112375965054021},20.140469956317528,22.020247152240497,22.825865950493196,29.539355935932374,36.252845921371545,41.623637909722888,49.679825892249895,null,null,{"$f":"D24/L110","v":22.825865950493192},{"$f":"(D24*DonnéesProjet!AA41)/L110","v":21.684572652968534},{"$f":"AO30/S110*DonnéesProjet!E41","v":21.68457265296853},{"$f":"IF(DonnéesProjet!B$20=\"O\",AO24,AP24)","v":21.684572652968534}]
[null,null,"Édification",{"$f":"AN31","v":1821520.0211889176},{"$f":"D25/(E$5*1000)","v":18.215200211889176},8.9939336788502321E-3,{"$f":"IF(DonnéesProjet!$B$9=\"Canada\",1,0.75)","v":0.75},5.9999999999999993E-3,2.0249999999999997E-2,6.7500000000000004E-2,{"$f":"G25","v":0.75},null,null,1.4249999999999999E-2,-1.0714285714285687E-4,null,4.7250000000000007E-2,-3.3750000000000065E-3,null,0.6825,-1.98,null,3.0240000000000006E-2,60.473952000000011,{"$f":"X25*R$7","v":66.397442698387067},3.2784388265179348E-2,0.27027027027027029,"Édification",{"$f":"(AC$23-AC$27)*($AA25/($AA$24+$AA$25+$AA$26))","v":14.769677967966187},{"$f":"(AD$23-AD$27)*($AA25/($AA$24+$AA$25+$AA$26))","v":16.112375965054021},20.140469956317528,22.020247152240497,22.825865950493196,29.539355935932374,36.252845921371545,41.623637909722888,49.679825892249895,null,null,{"$f":"D25/L111","v":22.825865950493196},{"$f":"(D25*DonnéesProjet!AA42)/L111","v":17.119399462869897},{"$f":"AO31/S111*DonnéesProjet!E42","v":17.119399462869897},{"$f":"IF(DonnéesProjet!B$20=\"O\",AO25,AP25)","v":17.119399462869897}]
[null,null,"Électricité\n",{"$f":"AN32","v":2444157.5619438435},24.441575619438435,1.2068267577116737E-2,{"$f":"IF(DonnéesProjet!$B$9=\"Canada\",1,0.7)","v":0.7},5.0196850393700778E-3,4.5177165354330702E-2,0.13730314960629919,{"$f":"G26","v":0.7},null,null,4.0157480314960622E-2,-1.2190663667041616E-2,null,9.2125984251968496E-2,-8.858267716535459E-4,null,0.56269685039370076,-1.5507874015748033,null,3.3264000000000002E-2,66.521347200000008,{"$f":"X26*R$7","v":73.037186968225768},3.606282709169728E-2,0.29729729729729731,"Électrique",{"$f":"(AC$23-AC$27)*($AA26/($AA$24+$AA$25+$AA$26))","v":16.246645764762803},{"$f":"(AD$23-AD$27)*($AA26/($AA$24+$AA$25+$AA$26))","v":17.723613561559421},22.15451695194928,24.222271867464546,25.108452545542512,32.493291529525607,39.878130513508701,45.786001700695174,54.647808481474883,null,null,{"$f":"D26/L112","v":25.108452545542516},{"$f":"(D26*DonnéesProjet!AA43)/L112","v":17.575916781879759},{"$f":"AO32/S112*DonnéesProjet!E43","v":17.575916781879759},{"$f":"IF(DonnéesProjet!B$20=\"O\",AO26,AP26)","v":17.575916781879759}]
[null,null,"Gestion / Encadrement\n",{"$f":"AN33","v":1341768.8448233332},13.417688448233331,6.6251152127396497E-3,{"$f":"IF(DonnéesProjet!$B$9=\"Canada\",1,0.1)","v":0.1},0,0,0,{"$f":"G27","v":0.1},null,null,0,0,null,0,0,null,0.1,-0.30000000000000004,null,1.8144000000000004E-2,36.28437120000001,{"$f":"X27*R$7","v":39.838465619032242},1.967063295910761E-2,0.16216216216216217,"Gestion",{"$f":"(AC$23*$AA27)/($D113/$D112)","v":9.2139982993048211},{"$f":"(AD$23*$AA27)/($D113/$D112)","v":10.051634508332532},12.564543135415665,13.73723382805446,14.239815553471088,18.427996598609642,22.616177643748198,25.96672247985904,30.992539734025307,null,null,{"$f":"D27/L113","v":14.23981555347109},{"$f":"(D27*DonnéesProjet!AA44)/L113","v":1.4239815553471089},{"$f":"AO33/S113*DonnéesProjet!E44","v":1.4239815553471091},{"$f":"IF(DonnéesProjet!B$20=\"O\",AO27,AP27)","v":1.4239815553471089}]
[null,null,"Divers",{"$f":"AN34","v":7696049.7238209052},76.960497238209058,3.7999999999999999E-2,{"$f":"IF(DonnéesProjet!$B$9=\"Canada\",1,0.5)","v":0.5},0,0,0,{"$f":"G28","v":0.5},null,null,0,0,null,0,0,null,0.5,-1.5,null,0,0,{"$f":"X28*R$7","v":0},0,null,null,null,null,null,null,null,null,null,null,null,null,"Coût de la main d'oeuvre par défaut",{"$f":"SUM(AN24:AN27)","v":85},{"$f":"SUM(AO24:AO27)","v":57.803870453065301},{"$f":"SUM(AP24:AP27)","v":57.803870453065301},{"$f":"SUM(AQ24:AQ27)","v":57.803870453065301}]
[null,null,"Sous-total pour la main-d'œuvre",{"$f":"SUM(D24:D28)","v":14408546.98041095},144.08546980410949,7.1143613269663633E-2,null,null,null,null,null,null,null,null,null,null,null,null,null,null,null,null,0.11188800000000003,223.75362240000004,{"$f":"SUM(Y24:Y28)","v":245.67053798403214},0.12130223658116358,1,"Emplois/MW",null,null,null,null,null,null,null,null,null,null,{"$f":"HLOOKUP(AM$21,AC$22:AK$33,2)","v":85},"Défaut","Révisé"]
[null,null,"Sous-total Services auxiliaires",{"$f":"D22+D29","v":46028504.820811436},460.28504820811435,0.2272702549955013,null,null,null,null,null,null,null,null,null,null,null,null,null,null,null,null,0.25188800000000006,503.72562240000008,{"$f":"Y22+Y29","v":525.64253798403217},0.25954115630994651,null,"Fondation ",{"$f":"AC24/AC$22","v":0.7384838983983093},{"$f":"AD24/AD$22","v":0.537079198835134},0.3356744992719588,0.29360329536320662,0.22825865950493196,0.19692903957288249,0.18126422960685773,0.16649455163889154,0.165599419640833,null,{"$f":"HLOOKUP(AM$21,AC$22:AK$33,9)*(AM$36^(AM$21-AL$36))","v":0.22825865950493196},{"$f":"(AM30*E$5)*L110","v":1105050.8286339508},{"$f":"DonnéesProjet!B41","v":1105050.8286339508}]
[null,null,"Coûts de l'équipement",null,null,null,null,null,null,null,null,null,null,null,null,null,null,null,null,null,null,null,null,null,null,null,null,"Édification",{"$f":"AC25/AC$22","v":0.7384838983983093},0.537079198835134,0.3356744992719588,0.29360329536320662,0.22825865950493196,0.19692903957288249,0.18126422960685773,0.16649455163889154,0.165599419640833,null,{"$f":"HLOOKUP(AM$21,AC$22:AK$33,10)*(AM$36^(AM$21-AL$36))","v":0.22825865950493196},{"$f":"(AM31*E$5)*L111","v":1821520.0211889176},{"$f":"DonnéesProjet!B42","v":1821520.0211889176}]
[null,null,"Turbines éoliennes et autres équipements (à l'exclusion des pales et des tours)\n",{"$f":"(E$9-(D$29-D$28))*V32","v":90235535.824108422},{"$f":"F32*D$9","v":902.35535824108422},{"$f":"D32/E$9","v":0.44554680444732464},{"$f":"IF(DonnéesProjet!$B$9=\"Canada\",0.2,IF(OR(DonnéesProjet!$B$9=\"Ontario\",DonnéesProjet!$B$9=\"Québec\"),0.1,0))","v":0},0,0,0,0,null,null,0,0,null,0,0,null,0,0,0.4608200458333333,0.43056,861.03388799999993,{"$f":"X32","v":861.03388799999993},0.42514392341731971,null,"Électrique",0.81233228823814019,0.59078711871864742,0.36924194919915465,0.32296362489952729,0.25108452545542514,0.21662194353017072,0.19939065256754351,0.1831440068027807,0.18215936160491628,null,{"$f":"HLOOKUP(AM$21,AC$22:AK$33,11)*(AM$36^(AM$21-AL$36))","v":0.25108452545542514},{"$f":"(AM32*E$5)*L112","v":2444157.5619438435},{"$f":"DonnéesProjet!B43","v":2444157.5619438435},null,null,null,null,null,0.4609583333333333,{"$f":"AU32/AU$47","v":0.23980508614548013}]
[null,null,"Pales",{"$f":"(E$9-(D$29-D$28))*V33","v":21125376.279891599},{"$f":"F33*D$9","v":211.25376279891597},{"$f":"D33/E$9","v":0.10430861642579504},{"$f":"IF(DonnéesProjet!$B$9=\"Canada\",0.6,IF(OR(DonnéesProjet!$B$9=\"Ontario\",DonnéesProjet!$B$9=\"Québec\"),0.2,0))","v":0},0,0,0,0,null,null,0,0,null,0,0,null,0,0,0.10788429166666665,0.1008,201.57983999999999,{"$f":"X33","v":201.57983999999999},9.953202220472368E-2,null,"Gestion / Encadrement",0.46069991496524104,0.33505448361108436,0.20940905225692774,0.1831631177073928,0.14239815553471089,0.12285331065739762,0.11308088821874099,0.10386688991943616,0.10330846578008436,null,{"$f":"HLOOKUP(AM$21,AC$22:AK$33,12)*(AM$36^(AM$21-AL$36))","v":0.14239815553471089},{"$f":"(AM33*E$5)*L113","v":1341768.8448233332},{"$f":"DonnéesProjet!B44","v":1341768.8448233332},null,null,null,null,null,0.10791666666666665,5.6141658963824774E-2]
[null,null,"Tours",{"$f":"(E$9-(D$29-D$28))*V34","v":23388809.452737126},233.88809452737127,0.11548453961427309,{"$f":"IF(DonnéesProjet!$B$9=\"Canada\",0.8,IF(OR(DonnéesProjet!$B$9=\"Ontario\",DonnéesProjet!$B$9=\"Québec\"),0.2,0))","v":0},0,0,0,0,null,null,0,0,null,0,0,null,0,0,0.11944332291666664,0.11159999999999999,223.17767999999998,{"$f":"X34","v":223.17767999999998},0.11019616744094407,null,"Divers",3.7999999999999999E-2,3.7999999999999999E-2,3.7999999999999999E-2,3.7999999999999999E-2,3.7999999999999999E-2,3.7999999999999999E-2,3.7999999999999999E-2,3.7999999999999999E-2,3.7999999999999999E-2,null,{"$f":"HLOOKUP(AM$21,AC$22:AK$34,13)","v":3.7999999999999999E-2},{"$f":"(AM34*E9)","v":7696049.7238209052},{"$f":"SUM(AO30:AO33)","v":6712497.2565900451},null,null,null,null,null,0.11947916666666664,6.215683670994885E-2]
[null,null,"Transport",{"$f":"(E$9-(D$29-D$28))*V35","v":16145823.299631439},161.45823299631439,7.9721585411143367E-2,{"$f":"IF(DonnéesProjet!$B$9=\"Canada\",1,0)","v":0},0,0,0,0,null,null,0,0,null,0,0,null,0,0,8.2454422916666659E-2,7.7039999999999997E-2,154.064592,{"$f":"X35","v":154.064592},7.6070902685038827E-2,null,null,null,null,null,null,null,null,null,null,null,null,null,null,null,null,null,null,null,null,8.2479166666666659E-2,4.2908267922351792E-2]
[null,null,"Sous-otal pour l'équipement",{"$f":"SUM(D32:D35)","v":150895544.8563686},1508.9554485636861,0.74506154589853624,null,null,null,null,null,null,null,null,null,null,null,null,null,null,null,0.77060208333333324,0.72,1439.856,{"$f":"X36","v":1439.856},0.71094301574802632,null,null,{"$f":"(AD30/AC30)^(1/(AD$22-AC$22))","v":0.96865635081697243},{"$f":"(AE30/AD30)^(1/(AE$22-AD$22))","v":0.98445529808077192},0.99111223725040287,0.98998053018268195,0.99705163501409733,0.99834362011773758,0.99830157969428823,0.99989218883934339,1,{"$f":"HLOOKUP(AM$21,AC$22:AK$33,1)","v":100},{"$f":"HLOOKUP(AM$21,AC$22:AK$36,15)","v":0.99705163501409733},null,null,null,null,null,null,null,{"$f":"SUM(AU32:AU35)","v":0.77083333333333326},0.40101184974160559]
[null,null,"Coûts de développement et autres"]
[null,null,"Sous-station/interconnexion HT",{"$f":"(E$9-(D$29-D$28))*V38","v":1957563.8251637009},19.57563825163701,9.665663298143173E-3,{"$f":"IF(DonnéesProjet!$B$9=\"Canada\",1,0.9)","v":0.9},6.6929133858267707E-3,6.0236220472440934E-2,0.18307086614173226,0.9,null,null,5.3543307086614166E-2,-1.6254218222722154E-2,null,0.12283464566929134,-1.1811023622047348E-3,null,0.71692913385826773,-1.9677165354330708,9.9970000000000007E-3,1.9600000000000003E-2,39.196080000000002,{"$f":"X38*R$7","v":43.035379526732349},2.1249140542245869E-2,null,null,null,null,null,null,null,null,null,null,null,null,null,null,null,null,null,null,null,null,0.01,5.2023158885397486E-3]
[null,null,"Matériel",{"$f":"D38*(1-Calculs!I25)","v":1498533.4877443062},14.985334877443064,7.3991560057140799E-3,{"$f":"IF(DonnéesProjet!$B$9=\"Canada\",1,0.9)","v":0.9},6.6929133858267707E-3,6.0236220472440934E-2,0.18307086614173226,0.9]
[null,null,"Main-d'œuvre",{"$f":"D38-D39","v":459030.33741939464},4.5903033741939465,2.266507292429094E-3,{"$f":"IF(DonnéesProjet!$B$9=\"Canada\",1,0.1)","v":0.1},0,0,0,0.1]
[null,null,"Ingénierie",{"$f":"(E$9-(D$29-D$28))*V41","v":2039128.9845455212},20.391289845455212,1.0068399268899136E-2,{"$f":"IF(DonnéesProjet!$B$9=\"Canada\",1,0)","v":0},0,0,0,0,null,null,0,0,null,0,0,null,0,0,1.0413541666666665E-2,6.4400000000000013E-3,12.878712000000002,{"$f":"X41","v":12.878712000000002},6.3589903075240142E-3,null,null,null,null,null,null,null,null,null,null,null,null,null,null,null,null,null,null,null,null,1.0416666666666664E-2,{"$f":"AU41/AU$47","v":5.4190790505622369E-3}]
[null,null,"Services juridiques",{"$f":"(E$9-(D$29-D$28))*V42","v":1111325.296577309},11.113252965773091,5.487277601550029E-3,{"$f":"IF(DonnéesProjet!$B$9=\"Canada\",1,1)","v":1},0,0,0,1,null,null,0,0,null,0,0,null,1,-3,5.6753802083333322E-3,5.0400000000000011E-4,1.0078992000000002,{"$f":"X42","v":1.0078992000000002},4.976601110236186E-4,null,null,null,null,null,null,null,null,null,null,null,null,null,null,null,null,null,null,null,null,5.6770833333333317E-3,{"$f":"AU42/AU$47","v":2.9533980825564186E-3}]
[null,null,"Servitudes foncières",{"$f":"(E$9-(D$29-D$28))*V43","v":0},0,0,{"$f":"IF(DonnéesProjet!$B$9=\"Canada\",1,1)","v":1},1,1,1,1,null,null,0,1,null,0,1,null,0,1,0,0,0,{"$f":"X43","v":0},0,null,null,null,null,null,null,null,null,null,null,null,null,null,null,null,null,null,null,null,null,0,{"$f":"AU43/AU$47","v":0}]
[null,null,"Permis/certificat d'implantation",{"$f":"(E$9-(D$29-D$28))*V44","v":519977.89105910808},5.199778910591081,2.5674418135692807E-3,{"$f":"IF(DonnéesProjet!$B$9=\"Canada\",1,1)","v":1},1,1,1,1,null,null,0,1,null,0,1,null,0,1,2.6554531250000003E-3,1.428E-3,2.8557144000000001,{"$f":"X44","v":2.8557144000000001},1.4100369812335856E-3,null,null,null,null,null,null,null,null,null,null,null,null,null,null,null,null,null,null,null,null,2.6562500000000002E-3,{"$f":"AU44/AU$47","v":1.3818651578933708E-3}]
[null,null,"Sous-total de coûts de développement et autres",{"$f":"SUM(D39:D44)","v":5627995.9973456394},{"$f":"SUM(E39:E44)","v":56.279959973456393},2.7788781982161621E-2,null,null,null,null,null,null,null,null,null,null,null,null,null,null,null,2.8741375E-2,2.7972000000000004E-2,55.938405600000003,{"$f":"SUM(Y38:Y44)","v":59.777705126732343},2.9515827942027083E-2,null,null,null,null,null,null,null,null,null,null,null,null,null,null,null,null,null,null,null,null,{"$f":"SUM(AU38:AU44)","v":2.8749999999999998E-2},{"$f":"AU45/AU$47","v":1.4956658179551776E-2}]
[null,null,"Sous-total (ensemble des coûts sans les taxes)\n",{"$f":"D30+D36+D45","v":202552045.67452568},{"$f":"E30+E36+E45","v":2025.520456745257},{"$f":"F22+F30+F36+F45","v":1.1562472246020368},null,null,null,null,null,null,null,null,null,null,null,null,null,null,null,null,null,{"$f":"X30+X36+X45","v":1999.5200279999999},{"$f":"Y30+Y36+Y45","v":2025.2762431107647}]
[null,null,"Taxe de vente (achats de matériel et d'équipement)",{"$f":"(D32+D33+D34+D22)*D101","v":0},{"$f":"D47/(E5*1000)","v":0},null,{"$f":"IF(DonnéesProjet!$B$9=\"Canada\",1,1)","v":1},1,1,1,1,null,null,0,1,null,0,1,null,0,1,2.6562500000000002E-3,1.428E-3,{"$f":"W47*$R$3","v":2.8557144000000001},{"$f":"X47","v":2.8557144000000001},1.4100369812335856E-3,null,null,null,null,null,null,null,null,null,null,null,null,null,null,null,null,null,null,null,null,{"$f":"SUM(AU18:AU45)","v":1.9222208366910465},{"$f":"SUM(AV18:AV45)","v":1}]
[null,null,"Total",{"$f":"D46+D47","v":202552045.67452568},{"$f":"E46+E47","v":2025.520456745257}]
[null,null,null,null,null,null,null,"Très petite","Petite","Moyenne","Grande",null,null,null,null,null,null,null,null,null,null,{"$f":"SUM(V18:V47)","v":1.9243004204400391},null,null,null,null,null,null,null,null,null,null,null,null,null,null,"Pour turbine < 1500 kW"]
[null,null,null,null,null,null,null,30000,100000,300000,400000,null,null,null,null,null,null,null,null,null,null,null,null,null,null,null,null,"O&M Emplois/",30,60,75,100,150,200,250,"MW",100]
[null,null,null,null,null,null,null,"Région","Région","Région","Région",null,null,null,null,null,null,null,null,null,null,null,null,null,null,null,null,"Technicien de terrain",2,2.4,3,4,6,8,9,null,7]
[null,null,"Parc éolien - Coûts annuels d'opération et de maintenance",null,null,null,"Part locale","Part locale","Part locale","Part locale","Part locale",null,null,null,null,null,null,null,null,null,null,null,null,null,null,null,null,"Admin",0.3,0.6,0.75,1,{"$f":"AF52","v":1},{"$f":"AH50/$AG50*$AG52","v":1.3333333333333333},{"$f":"AH52","v":1.3333333333333333},null,1]
[null,null,null,null,null,null,null,null,null,null,null,null,null,null,null,null,null,null,null,null,null,null,null,null,null,null,null,"Gestion",0.5,1,1,1,1,1,1,null,1]
[null,null,"Personnel",null,null,null,null,null,null,null,null,null,null,null,null,null,null,null,null,null,null,null,null,null,null,null,null,"Total",{"$f":"SUM(AC51:AC53)","v":2.8},{"$f":"SUM(AD51:AD53)","v":4},4.75,6,8,10.333333333333334,11.333333333333334]
[null,null,"Salaires du personnel de terrain (c.-à-d. techniciens sur place, etc.)",{"$f":"K4*L115","v":358201.52175897441},{"$f":"D55/(E$5*1000)","v":3.5820152175897442},{"$f":"E55/E$80","v":0.14328060870358977},{"$f":"IF(DonnéesProjet!$B$9=\"Canada\",1,1)","v":1},1,1,1,1,null,{"$f":"(M$13-H$13)/(I$13-H$13)","v":-0.42857142857142855},{"$f":"I55-H55","v":0},{"$f":"H55+$M$55*N55","v":1},{"$f":"(M$13-I$13)/(J$13-I$13)","v":-0.5},{"$f":"J55-I55","v":0},{"$f":"I55+$P$55*Q55","v":1},{"$f":"IF((M$13-J$13)/(K$13-J$13)>1,1,(M$13-J$13)/(K$13-J$13))","v":-3},{"$f":"K55-J55","v":0},{"$f":"J55+$S$55*T55","v":1},null,null,null,null,null,null,null,null,null,null,null,null,null,null,{"$f":"IF(E5<30,30,E5)","v":100},"MW"]
[null,null,"Administration",{"$f":"K5*L116","v":59934.572028101422},0.59934572028101418,{"$f":"E56/E$80","v":2.3973828811240567E-2},{"$f":"IF(DonnéesProjet!$B$9=\"Canada\",1,1)","v":1},1,1,1,1,null,null,{"$f":"I56-H56","v":0},{"$f":"H56+$M$55*N56","v":1},null,{"$f":"J56-I56","v":0},{"$f":"I56+$P$55*Q56","v":1},null,{"$f":"K56-J56","v":0},{"$f":"J56+$S$55*T56","v":1},null,null,null,null,null,null,"Tech/MW",{"$f":"AC51/AC$50","v":6.6666666666666666E-2},{"$f":"AD51/AD$50","v":0.04},0.04,0.04,0.04,0.04,3.5999999999999997E-2,{"$f":"HLOOKUP(AJ$55,AC$50:AI$58,7)*(AJ60^(AJ$55-AL$36))","v":0.04},{"$f":"AK51/AK$50","v":7.0000000000000007E-2},null,"Tech/MW",null,null,{"$f":"IF(DonnéesProjet!B$12<1500,AK56,AJ56)","v":0.04},null,"Coût O&M par kW",null,{"$f":"IF(DonnéesProjet!B11<=20,DonnéesParDéfaut!AO8,IF(DonnéesProjet!B11>=100,DonnéesParDéfaut!AO9,AO8*(AT57^(DonnéesProjet!B11-20))))","v":20.500472895138206}]
[null,null,"Gestion",{"$f":"K6*L117","v":142852.72292674455},1.4285272292674456,{"$f":"E57/E$80","v":5.7141089170697823E-2},{"$f":"IF(DonnéesProjet!$B$9=\"Canada\",1,1)","v":1},1,1,1,1,null,null,{"$f":"I57-H57","v":0},{"$f":"H57+$M$55*N57","v":1},null,{"$f":"J57-I57","v":0},{"$f":"I57+$P$55*Q57","v":1},null,{"$f":"K57-J57","v":0},{"$f":"J57+$S$55*T57","v":1},null,null,null,null,null,null,"Admin/MW",{"$f":"AC52/AC$50","v":0.01},0.01,0.01,0.01,6.6666666666666671E-3,6.6666666666666662E-3,5.3333333333333332E-3,{"$f":"HLOOKUP(AJ$55,AC$50:AI$58,8)*(AJ61^(AJ$55-AL$36))","v":0.01},{"$f":"AK52/AK$50","v":0.01},null,"Admin/MW",null,null,{"$f":"IF(DonnéesProjet!B$12<1500,AK57,AJ57)","v":0.01},null,"Fonction ajustment coûts O&M ",null,{"$f":"(AO9/AO8)^((1/(100-20)))","v":0.99727560488156075}]
[null,null,"Sous-total pour la main-d'œuvre et le personnel",{"$f":"SUM(D55:D57)","v":560988.81671382044},5.6098881671382044,{"$f":"SUM(F55:F57)","v":0.22439552668552817},null,null,null,null,null,null,null,null,null,null,null,null,null,null,null,null,null,null,null,null,null,"Gest/MW",1.6666666666666666E-2,1.6666666666666666E-2,1.3333333333333334E-2,0.01,6.6666666666666671E-3,5.0000000000000001E-3,4.0000000000000001E-3,{"$f":"HLOOKUP(AJ$55,AC$50:AI$58,9)*(AJ62^(AJ$55-AL$36))","v":0.01},{"$f":"AK53/AK$50","v":0.01},null,"Gest/MW",null,null,{"$f":"IF(DonnéesProjet!B$12<1500,AK58,AJ58)","v":0.01}]
[null,null,"Services de garantie/maintenance",0,0,{"$f":"E59/E$80","v":0},{"$f":"IF(DonnéesProjet!$B$9=\"Canada\",1,0)","v":0},0,0,0,0]
[null,null,"TOTAL",{"$f":"D58+D59","v":560988.81671382044},5.6098881671382044,{"$f":"F58+F59","v":0.22439552668552817},null,null,null,null,null,null,null,null,null,null,null,null,null,null,null,null,null,null,null,null,null,null,{"$f":"(AD56/AC56)^(1/(AD$50-AC$50))","v":0.98311662811417255},1,1,1,1,0.9978950082958632,1,{"$f":"HLOOKUP(AJ$55,AC$50:AI$62,11)","v":1}]
[null,null,null,null,null,null,null,null,null,null,null,null,null,null,null,null,null,null,null,null,null,null,null,null,null,null,null,null,{"$f":"(AD57/AC57)^(1/(AD$50-AC$50))","v":1},1,1,0.99192348952950216,1,0.9955470727844663,1,{"$f":"HLOOKUP(AJ$55,AC$50:AI$62,12)","v":0.99192348952950216}]
[null,null,"Matériel et services",null,null,null,null,null,null,null,null,null,null,null,null,null,null,null,null,null,null,"Allocation des coûts d'O&M",null,null,null,null,null,null,1,0.98523386779906386,0.9885586726496457,0.99192348952950216,0.99426287904640476,0.9955470727844663,1,{"$f":"HLOOKUP(AJ$55,AC$50:AI$62,13)","v":0.99192348952950216}]
[null,null,"Véhicules",{"$f":"(((E$5*1000)*F$9)-D$60)*V63","v":55392.406321559203},{"$f":"D63/(E$5*1000)","v":0.55392406321559207},{"$f":"E63/E$80","v":2.2156962528623682E-2},{"$f":"IF(DonnéesProjet!$B$9=\"Canada\",1,1)","v":1},0,0,1,1,null,{"$f":"(M$13-H$13)/(I$13-H$13)","v":-0.42857142857142855},{"$f":"I63-H63","v":0},{"$f":"H63+$M$63*N63","v":0},{"$f":"(M$13-I$13)/(J$13-I$13)","v":-0.5},{"$f":"J63-I63","v":1},{"$f":"I63+$P$63*Q63","v":-0.5},{"$f":"IF((M$13-J$13)/(K$13-J$13)>1,1,(M$13-J$13)/(K$13-J$13))","v":-3},{"$f":"K63-J63","v":0},{"$f":"J63+$S$63*T63","v":1},2.8567347521782607E-2]
[null,null,"Entretien du site et services divers",21603.038465408088,{"$f":"D64/(E$5*1000)","v":0.21603038465408089},8.6412153861632358E-3,{"$f":"IF(DonnéesProjet!$B$9=\"Canada\",1,0.8)","v":0.8},1.0847457627118645E-2,4.7883777239709449E-2,0.12745762711864408,0.8,null,null,{"$f":"I64-H64","v":3.7036319612590803E-2},{"$f":"H64+$M$63*N64","v":-5.0252507782774115E-3},null,{"$f":"J64-I64","v":7.9573849878934635E-2},{"$f":"I64+$P$63*Q64","v":8.0968523002421314E-3},null,{"$f":"K64-J64","v":0.67254237288135599},{"$f":"J64+$S$63*T64","v":-1.8901694915254239},1.1141265533495216E-2]
[null,null,"Redevances, permis, autorisations",10801.519232704044,0.10801519232704045,4.3206076930816179E-3,{"$f":"IF(DonnéesProjet!$B$9=\"Canada\",1,1)","v":1},1,1,1,1,null,null,0,1,null,0,1,null,0,1,5.570632766747608E-3]
[null,null,"Services",43206.076930816176,0.43206076930816179,1.7282430772326472E-2,{"$f":"IF(DonnéesProjet!$B$9=\"Canada\",1,1)","v":1},1,1,1,1,null,null,0,1,null,0,1,null,0,1,2.2282531066990432E-2]
[null,null,"Assurances",415443.04741169396,4.15443047411694,0.1661772189646776,{"$f":"IF(DonnéesProjet!$B$9=\"Canada\",1,0)","v":0},0,0,0,0,null,null,0,0,null,0,0,null,0,0,0.21425510641336953]
[null,null,"Carburant (pour les véhicules à moteur)",21603.038465408088,0.21603038465408089,8.6412153861632358E-3,{"$f":"IF(DonnéesProjet!$B$9=\"Canada\",1,1)","v":1},1,1,1,1,null,null,0,1,null,0,1,null,0,1,1.1141265533495216E-2]
[null,null,"Produits, outils et fournitures diverses",140419.75002515258,1.4041975002515257,5.6167900010061028E-2,{"$f":"IF(DonnéesProjet!$B$9=\"Canada\",1,1)","v":1},2.4924471299093656E-2,9.6525679758308169E-2,0.24169184290030213,1,null,null,7.1601208459214513E-2,-5.7617608977125617E-3,null,0.14516616314199396,2.394259818731119E-2,null,0.7583081570996979,-2.0332326283987912,7.2418225967718908E-2]
[null,null,"Inventaire des pièces de rechange, de l'équipement et des pièces détachées",1230542.3064334374,12.305423064334374,0.49221692257337496,{"$f":"IF(DonnéesProjet!$B$9=\"Canada\",1,0.02)","v":0.02},0,0,0,0.02,null,null,0,0,null,0,0,null,0.02,-0.06,0.63462362519640048]
[null,null,"Sous-total pour le matériel et les services",{"$f":"SUM(D63:D70)","v":1939011.1832861796},{"$f":"SUM(E63:E70)","v":19.390111832861795},{"$f":"SUM(F63:F70)","v":0.7756044733144718}]
[null,null,"Taxe de vente (achats de matériel et d'équipement)",{"$f":"(D63+D69+D70)*D101","v":0},0,null,{"$f":"IF(DonnéesProjet!$B$9=\"Canada\",1,1)","v":1}]
[null,null,"Autres impôts et frais",0,null,null,{"$f":"IF(DonnéesProjet!$B$9=\"Canada\",1,1)","v":1}]
[null,null,"Total (taxes et autres frais inclus)",{"$f":"D60+D71+D72+D73","v":2500000},{"$f":"D74/(E$5*1000)","v":25}]
[null,null,"Paiement de la dette (moyenne annuelle)",{"$f":"Calculs!F197","v":14706314.830296485}]
[null,null,"Paiement du capital - Particuliers ",0]
[null,null,"Paiement du capital - Entreprises",0]
[null,null,"Location de terrain",{"$f":"D103*D5","v":330000}]
[null,null,"Total des coûts annuels d'operation et de maintenance",{"$f":"D74+D75+D78","v":17536314.830296487}]
[null,null,null,{"$f":"D71+D60","v":2500000},{"$f":"D80/(E5*1000)","v":25}]
[null,null,"Parc éolien - Autres paramètres"]
[null,null,"Paramètres financiers",null,null,null,"Part locale"]
[null,null,"Financement par emprunt"]
[null,null,"Pourcentage de financement",0.8,null,null,{"$f":"IF(DonnéesProjet!$B$9=\"Canada\",1,0)","v":0}]
[null,null,"Années de financement (échéance)",20]
[null,null,"Taux d'intérêt",6.5000000000000002E-2]
[null,null,"Paiement annuel moyen (intérêt et capital)",{"$f":"D75","v":14706314.830296485}]
[null,null,"Financement en fonds propres ",null,null,null,"Part locale"]
[null,null,"Pourcentage de fonds propres",{"$f":"1-D84","v":0.19999999999999996}]
[null,null,"Investisseurs particuliers (pourcentage du capital total)",0,null,null,{"$f":"IF(DonnéesProjet!$B$9=\"Canada\",1,1)","v":1}]
[null,null,"Sociétés d'investissement (pourcentage du capital total)",{"$f":"1-D90","v":1},null,null,{"$f":"IF(DonnéesProjet!$B$9=\"Canada\",1,0)","v":0}]
[null,null,"Rendement des fonds propres (taux d'intérêt annuel)",0.1]
[null,null,"Durée de remboursement (années)",20]
[]
[null,null,"Paramètres fiscaux"]
[null,null,"Taux local de l'impôt foncier (taux par mille - $/1 000 $)",{"$f":"D158","v":"NA"}]
[null,null,"Valeur estimée (pourcentage du coût de construction)",{"$f":"D157","v":"NA"}]
[null,null,"Valeur imposable",{"$f":"IF(D96=\"NA\", \"NA\",D48*D97)","v":"NA"}]
[null,null,"Taxes par MW",{"$f":"D141","v":5555}]
[null,null,"Impôts locaux",{"$f":"IF($D97=\"NA\",IF(D99=\"NA\",\"NA\",$D99*$E5),(D98/1000)*D96)","v":555500},null,null,{"$f":"IF(DonnéesProjet!$B$9=\"Canada\",1,1)","v":1}]
[null,null,"Taux local de la taxe de vente",{"$f":"D149","v":0},null,null,{"$f":"IF(DonnéesProjet!$B$9=\"Canada\",1,1)","v":1}]
[null,null,"Paramètres des baux fonciers"]
[null,null,"Coût de location du terrain (par éolienne)",{"$f":"DonnéesProjet!B12*(3300/1000)","v":8250}]
[null,null,"Location du terrain (coût total)",{"$f":"D103*D5","v":330000}]
[null,null,"Bénéficiaire du paiement du bail (M = ménage/agriculteur, A = autre)","M",null,null,{"$f":"IF(DonnéesProjet!$B$9=\"Canada\",1,1)","v":1},null,null,null,null,null,"Charges salariale"]
[null,null,"Services de garantie/maintenance","Non applicable",null,null,null,null,null,null,null,null,"Gouv.",{"$f":"VLOOKUP(DonnéesProjet!B9,Multiplicateurs!S8:U22,3,FALSE)","v":0.27}]
[null,null,null,null,null,null,null,null,null,null,null,null,"Santé/Ass./divers",{"$f":"IF(OR(DonnéesProjet!B9=Multiplicateurs!Z8,RégionPersonnalisée!B5=Multiplicateurs!Z8),Multiplicateurs!Y8,Multiplicateurs!Y7)","v":6.83E-2},"Données révisées par l'utilisateur"]
[null,null,"Paramètres de rémunération","Coût salarial","Taux horaire moy.","Taux horaire ajusté","Charges","Charges","Défaut","Révisé (utilisateur)",null,null,"Total",{"$f":"N106+N107","v":0.33830000000000005},"Coût slarial","Taux horaire","Charges","Charges"]
[null,null,"Main-d'œuvre en construction",null,null,null,null,null,null,null,null,"Défaut"]
[null,null,"Fondations",{"$f":"F110+G110","v":23.275105443776887},15.84,{"$f":"E110*R$7","v":17.39154557556369},{"$f":"F110*H110","v":5.8835598682131973},{"$f":"N$108","v":0.33830000000000005},{"$f":"(DonnéesParDéfaut!D24*G24)/(D110*(52*40))","v":21.68457265296853},{"$f":"(DonnéesProjet!B41*DonnéesProjet!E41)/(DonnéesParDéfaut!O110*(40*52))","v":21.68457265296853},null,{"$f":"D110*52*40","v":48412.219323055921},null,null,{"$f":"P110+Q110","v":23.275105443776887},{"$f":"DonnéesProjet!B111","v":17.39154557556369},{"$f":"P110*R110","v":5.8835598682131973},{"$f":"DonnéesProjet!D111","v":0.33830000000000005},{"$f":"O110*52*40","v":48412.219323055921}]
[null,null,"Édification",{"$f":"F111+G111","v":38.365719895013541},26.11,{"$f":"E111*R$7","v":28.667503470831306},{"$f":"F111*H111","v":9.6982164241822328},{"$f":"N$108","v":0.33830000000000005},{"$f":"(DonnéesParDéfaut!D25*G25)/(D111*(52*40))","v":17.119399462869893},{"$f":"(DonnéesProjet!B42*DonnéesProjet!E42)/(DonnéesParDéfaut!O111*(40*52))","v":17.119399462869893},null,{"$f":"D111*52*40","v":79800.697381628153},null,null,{"$f":"P111+Q111","v":38.365719895013541},{"$f":"DonnéesProjet!B112","v":28.667503470831306},{"$f":"P111*R111","v":9.6982164241822328},{"$f":"DonnéesProjet!D112","v":0.33830000000000005},{"$f":"O111*52*40","v":79800.697381628153}]
[null,null,"Électricité\n",{"$f":"F112+G112","v":46.800006842442798},31.85,34.969742839754012,{"$f":"F112*H112","v":11.830264002688784},{"$f":"N$108","v":0.33830000000000005},{"$f":"(DonnéesParDéfaut!D26*G26)/(D112*(52*40))","v":17.575916781879762},{"$f":"(DonnéesProjet!B43*DonnéesProjet!E43)/(DonnéesParDéfaut!O112*(40*52))","v":17.575916781879762},null,{"$f":"D112*52*40","v":97344.014232281028},null,null,{"$f":"P112+Q112","v":46.800006842442798},{"$f":"DonnéesProjet!B113","v":34.969742839754012},{"$f":"P112*R112","v":11.830264002688784},{"$f":"DonnéesProjet!D113","v":0.33830000000000005},97344.014232281028]
[null,null,"Gestion / Encadrement\n",{"$f":"F113+G113","v":45.30123111310867},30.83,33.849832707994224,{"$f":"F113*H113","v":11.451398405114448},{"$f":"N$108","v":0.33830000000000005},{"$f":"(DonnéesParDéfaut!D27*G27)/(D113*(52*40))","v":1.4239815553471089},{"$f":"(DonnéesProjet!B44*DonnéesProjet!E44)/(DonnéesParDéfaut!O113*(40*52))","v":1.4239815553471089},null,{"$f":"D113*52*40","v":94226.560715266038},null,null,{"$f":"P113+Q113","v":45.30123111310867},{"$f":"DonnéesProjet!B114","v":33.849832707994224},{"$f":"P113*R113","v":11.451398405114448},{"$f":"DonnéesProjet!D114","v":0.33830000000000005},94226.560715266038]
[null,null,"Main-d'œuvre en O&M",null,null,{"$f":"SUM(F110:F113)","v":114.87862459414323},null,null,"Employés directs ",null,null,null,null,null,null,{"$f":"SUM(P110:P113)","v":114.87862459414323},null,{"$f":"SUM(R110:R113)","v":1.3532000000000002},null,null,null,null,null,null,null,null,"par kW ajusté"]
[null,null,"Salaires du personnel de terrain (c.-à-d. techniciens sur place, etc.)",{"$f":"F115+G115","v":43.053067519107501},29.3,{"$f":"E115*R$7","v":32.169967510354553},{"$f":"F115*H115","v":10.883100008752947},{"$f":"N$108","v":0.33830000000000005},{"$f":"(D55*G55)/(D115*(52*40))","v":4},{"$f":"(Calculs!D66*Calculs!E66)/(DonnéesParDéfaut!O115*(40*52))","v":4},null,{"$f":"D115*52*40","v":89550.380439743603},null,null,{"$f":"P115+Q115","v":43.053067519107501},{"$f":"DonnéesProjet!B116","v":32.169967510354553},{"$f":"P115*R115","v":10.883100008752947},{"$f":"DonnéesProjet!D116","v":0.33830000000000005},89550.380439743603,{"$f":"S115*K4","v":358201.52175897441},{"$f":"V115+W115","v":39.21219},{"$f":"E115","v":29.3},{"$f":"V115*X115","v":9.9121900000000007},{"$f":"N$108","v":0.33830000000000005},{"$f":"U115*52*40","v":81561.355199999991},{"$f":"Y115*K4","v":326245.42079999996}]
[null,null,"Administration",{"$f":"F116+G116","v":28.814698090433374},19.61,{"$f":"E116*R$7","v":21.53082125863661},{"$f":"F116*H116","v":7.2838768317967659},{"$f":"N$108","v":0.33830000000000005},{"$f":"(D56*G56)/(D116*(52*40))","v":1},{"$f":"(Calculs!D67*Calculs!E67)/(DonnéesParDéfaut!O116*(40*52))","v":1},null,{"$f":"D116*52*40","v":59934.572028101422},null,null,{"$f":"P116+Q116","v":28.814698090433374},{"$f":"DonnéesProjet!B117","v":21.53082125863661},{"$f":"P116*R116","v":7.2838768317967659},{"$f":"DonnéesProjet!D117","v":0.33830000000000005},59934.572028101422,{"$f":"S116*K5","v":59934.572028101422},{"$f":"V116+W116","v":26.244063000000001},{"$f":"E116","v":19.61},{"$f":"V116*X116","v":6.6340630000000003},{"$f":"N$108","v":0.33830000000000005},{"$f":"U116*52*40","v":54587.651039999997},{"$f":"Y116*K5","v":54587.651039999997}]
[null,null,"Gestion / Encadrement\n",{"$f":"F117+G117","v":68.679193714781036},46.74,51.318234861227701,{"$f":"F117*H117","v":17.360958853553335},{"$f":"N$108","v":0.33830000000000005},{"$f":"(D57*G57)/(D117*(52*40))","v":1},{"$f":"(Calculs!D68*Calculs!E68)/(DonnéesParDéfaut!O117*(40*52))","v":1},null,{"$f":"D117*52*40","v":142852.72292674455},null,null,{"$f":"P117+Q117","v":68.679193714781036},{"$f":"DonnéesProjet!B118","v":51.318234861227701},{"$f":"P117*R117","v":17.360958853553335},{"$f":"DonnéesProjet!D118","v":0.33830000000000005},142852.72292674455,{"$f":"S117*K6","v":142852.72292674455},{"$f":"V117+W117","v":62.552142000000003},46.74,{"$f":"V117*X117","v":15.812142000000003},{"$f":"N$108","v":0.33830000000000005},{"$f":"U117*52*40","v":130108.45536000001},{"$f":"Y117*K6","v":130108.45536000001}]
[null,null,null,null,null,{"$f":"SUM(F115:F117)","v":105.01902363021887},{"$f":"SUM(H115:H117)","v":1.0149000000000001},{"$f":"SUM(I115:I117)","v":6},{"$f":"SUM(J115:J117)","v":6},null,null,null,null,null,null,{"$f":"SUM(P115:P117)","v":105.01902363021887},null,{"$f":"SUM(R115:R117)","v":1.0149000000000001},null,null,null,null,null,null,{"$f":"SUM(Z115:Z117)","v":510941.52720000001}]
[null,null,"Marges commerciales et de transport",null,null,null,null,null,null,null,null,null,null,null,null,null,null,null,null,null,null,null,null,null,{"$f":"D58-Y118","v":50047.289513820433},{"$f":"Y119/(E5*1000)","v":0.50047289513820437}]
[null,null,null,"Agriculture","Exploitation minière","Construction","Secteur manufacturier","Fabrication de produits métalliques","Machinerie","Équipements électriques","TCSP","Commerce de gros","Commerce de détail","FAI","Services divers","Services professionels","Gouvernement","Total"]
[null,null,"Agriculture",0.96223913488966895,0,0,0,0,0,0,1.5312164404600849E-2,2.2448700705730174E-2,0,0,0,0,0,1]
[null,null,"Exploitation minière",0,0.92690404568968099,0,0,0,0,0,6.2888915468109916E-2,1.0207038842209132E-2,0,0,0,0,0,1]
[null,null,"Construction",0,0,1,0,0,0,0,0,0,0,0,0,0,0,1]
[null,null,"Secteur manufacturier",0,0,0,0.87760641657876026,0,0,0,3.2775996345246736E-2,8.9617587075993016E-2,0,0,0,0,0,0.99999899999999997]
[null,null,"Fabrication de produits métalliques",0,0,0,0,0.85728462300321351,0,0,2.5094685621712236E-2,0.11762069137507425,0,0,0,0,0,1]
[null,null,"Machinerie",0,0,0,0,0,0.81678173764013584,0,3.2917924186119723E-3,0.17992646994125222,0,0,0,0,0,0.99999900000000008]
[null,null,"Équipements électriques",0,0,0,0,0,0,0.88938689188667497,1.6524559986576089E-2,9.4088548126748939E-2,0,0,0,0,0,1]
[null,null,"TCSP",0,0,0,0,0,0,0,0.99998284935316217,7.8346524902031456E-6,0,0,0,0,0,1]
[null,null,"Commerce de gros",0,0,0,0,0,0,0,0,1,0,0,0,0,0,1]
[null,null,"Commerce de détail",0,0,0,0,0,0,0,0,0,1,0,0,0,0,1]
[null,null,"FAI",0,0,0,0,0,0,0,0,0,0,1,0,0,0,1]
[null,null,"Services divers",0,0,0,0,0,0,0,2.0059234012309324E-4,5.7602368108455194E-3,0,0,0.99403917084903137,0,0,1]
[null,null,"Services professionels",0,0,0,0,0,0,0,1.8691859431951759E-4,6.8551078138554067E-3,0,0,0,0.99295797359182503,0,1]
[null,null,"Gouvernement",0,0,0,0,0,0,0,3.2252779744282687E-5,5.8527324581989133E-4,0,0,0,0,0.9993824739744358,1]
[]
[]
[null,null,null,"Canada","Alberta","Colombie-Britannique","Manitoba","Nouveau-Brunswick","Terre-Neuve-et-Labrador","Territoires du Nord-Ouest","Nouvelle-Écosse","Nunavut","Ontario","Île-du-Prince-Édouard","Québec","Saskatchewan","Yukon","MARÉGION"]
[null,null,"Taxes par MW",{"$f":"D144","v":5555},5555,11976,9945,3830,null,null,6134,null,2294,1284,null,null,null,{"$f":"HLOOKUP(RégionPersonnalisée!B5,DonnéesParDéfaut!D137:Q138,2,FALSE)","v":5555}]
[]
[null,null," Taxes provinciale / territoriale par MW",{"$f":"HLOOKUP(Calculs!$E$1,D137:R138,2,FALSE)","v":5555}]
[null,null,null,{"$f":"IF(D140=0,\"NA\",D140)","v":5555}]
[]
[null,null,"CA coût moyen par MW",{"$f":"AVERAGE(E138:Q138)","v":5859.7142857142853}]
[null,null,"CA coût médian par MW",{"$f":"MEDIAN(E138:Q138)","v":5555}]
[]
[null,null,"Taxe de vente",0.05,0,7.0000000000000007E-2,7.0000000000000007E-2,0.1,0.1,0,0.1,0,0.08,0.1,9.9750000000000005E-2,0.06,0,{"$f":"HLOOKUP(RégionPersonnalisée!B5,DonnéesParDéfaut!D137:Q146,10,FALSE)","v":0.05}]
[]
[]
[null,null,null,{"$f":"HLOOKUP(DonnéesProjet!B9,DonnéesParDéfaut!$D$137:$R$147,10,FALSE)","v":0}]
[null,null,null,{"$f":"HLOOKUP(RégionPersonnalisée!B5,DonnéesParDéfaut!$D$137:$R$147,10)","v":0}]
[]
[]
[null,null,2016,"Canada","Alberta","Colombie-Britannique","Manitoba","Nouveau-Brunswick","Terre-Neuve-et-Labrador","Territoires du Nord-Ouest","Nouvelle-Écosse","Nunavut","Ontario","Île-du-Prince-Édouard","Québec","Saskatchewan","Yukon","MARÉGION"]
[null,null,"Ration d'évalutaion foncière (%)","NA","NA","NA","NA","NA",1,1,"NA",1,"NA","NA",1,1,1,{"$f":"HLOOKUP(RégionPersonnalisée!B$5,DonnéesParDéfaut!D$153:Q$155,2,FALSE)","v":"NA"}]
[null,null,"Taux par mille moyen ($/$1000 de la valeur estimée)","NA","NA","NA","NA","NA",7.7,6.59,"NA",4.62,"NA","NA",13,8.8000000000000007,7.6,{"$f":"HLOOKUP(RégionPersonnalisée!B$5,DonnéesParDéfaut!D$153:Q$155,3,FALSE)","v":"NA"}]
[]
[null,null,"Ration d'évalutaion foncière (%)",{"$f":"HLOOKUP(DonnéesProjet!B9,D153:R155,2,FALSE)","v":"NA"}]
[null,null,"Taux par mille moyen ($/$1000 de la valeur estimée)",{"$f":"HLOOKUP(DonnéesProjet!B9,D153:R155,3,FALSE)","v":"NA"}]

{"sheet":"Calculs","index":7,"n_rows":233,"n_cols":37,"rows_kept":233,"cut":false,"hidden":false,"merged":[[39,12,39,23],[31,12,31,23],[0,0,16,1]]}
["*** AVERTISSEMENT ***\n\nCette feuille de calcul contient des données et des formules qui font partie intégrante du modèle EI2. \nBien que ces données et formules soient consultables pour examen, elles ne doivent pas être modifiées.\nToute modification des données ou des formules affectera l'analyse et pourrait invalider les résultats du modèle.\n\nPour les visualiser, faites simplement défiler les colonnes vers la droite.",null,"Analyse d'iimpacts économiques pour ",null,{"$f":"DonnéesProjet!B9","v":"Alberta"},"centrale éolienne"]
[]
[null,null,"Coûts de construction du projet"]
[null,null,null,"Coût","Part locale",null,"Dépenses locales",null,null,null,null,null,null,null,null,null,null,null,null,null,null,null,null,null,null,null,null,"Coûts de construction du projet","Coût","Part locale"]
[null,null,"Systèmes Auxilliaires",null,null,null,null,null,null,null,null,null,null,null,null,null,null,null,null,null,null,null,null,null,null,null,null,"Systèmes Auxilliaires"]
[null,null,"Matériaux",null,null,null,null,null,null,null,null,null,null,null,null,null,null,null,null,null,null,null,null,null,null,null,null,"Matériaux"]
[null,null,"Construction (béton, armature, équipement, voies d'accès et préparation du site)",{"$f":"IF(DonnéesProjet!$B$20=\"O\",DonnéesParDéfaut!D18,DonnéesProjet!B35)","v":21804406.524476796},{"$f":"IF(DonnéesProjet!$B$20=\"O\",IF(DonnéesProjet!AA$9=0,DonnéesParDéfaut!G18,DonnéesProjet!AA35),DonnéesProjet!E35)","v":0.9},null,{"$f":"D7*E7","v":19623965.872029118},null,null,null,null,null,null,null,null,null,null,null,null,null,null,null,null,null,null,null,null,"Construction (béton, armature, équipement, voies d'accès et préparation du site)",{"$f":"D7","v":21804406.524476796},0.9]
[null,null,"Transformateur",{"$f":"IF(DonnéesProjet!$B$20=\"O\",DonnéesParDéfaut!D19,DonnéesProjet!B36)","v":2466530.4197062631},{"$f":"IF(DonnéesProjet!$B$20=\"O\",IF(DonnéesProjet!AA$9=0,DonnéesParDéfaut!G19,DonnéesProjet!AA36),DonnéesProjet!E36)","v":0},null,{"$f":"D8*E8","v":0},null,null,null,null,null,null,null,null,null,null,null,null,null,null,null,null,null,null,null,null,"Transformateur",2466530.4197062631,0]
[null,null,"Électricité (câble de dérivation, fil)\n",{"$f":"IF(DonnéesProjet!$B$20=\"O\",DonnéesParDéfaut!D20,DonnéesProjet!B37)","v":2599889.7286412967},{"$f":"IF(DonnéesProjet!$B$20=\"O\",IF(DonnéesProjet!AA$9=0,DonnéesParDéfaut!G20,DonnéesProjet!AA37),DonnéesProjet!E37)","v":1},null,{"$f":"D9*E9","v":2599889.7286412967},null,null,null,null,null,null,null,null,null,null,null,null,null,null,null,null,null,null,null,null,"Électricité (câble de dérivation, fil)\n",2599889.7286412967,1]
[null,null,"Prolongement de la ligne HT",{"$f":"IF(DonnéesProjet!$B$20=\"O\",DonnéesParDéfaut!D21,DonnéesProjet!B38)","v":4749131.1675761305},{"$f":"IF(DonnéesProjet!$B$20=\"O\",IF(DonnéesProjet!AA$9=0,DonnéesParDéfaut!G21,DonnéesProjet!AA38),DonnéesProjet!E38)","v":0.7},null,{"$f":"D10*E10","v":3324391.8173032911},null,null,null,null,null,null,null,null,null,null,null,null,null,null,null,null,null,null,null,null,"Prolongement de la ligne HT",4749131.1675761305,0.7]
[null,null,"Sous-total pour les matériaux",{"$f":"SUM(D7:D10)","v":31619957.840400487},null,null,{"$f":"SUM(G7:G10)","v":25548247.417973708},null,null,null,null,null,null,null,null,null,null,null,null,null,null,null,null,null,null,null,null,"Sous-total pour les matériaux",{"$f":"D11","v":31619957.840400487}]
[null,null,"Main-d'œuvre",null,null,null,null,null,null,null,null,null,null,null,null,null,null,null,null,null,null,null,null,null,null,null,null,"Main-d'œuvre"]
[null,null,"Fondations",{"$f":"IF(DonnéesProjet!$B$20=\"O\",DonnéesParDéfaut!D24,DonnéesProjet!B41)","v":1105050.8286339508},{"$f":"IF(DonnéesProjet!$B$20=\"O\",IF(DonnéesProjet!AA$9=0,DonnéesParDéfaut!G24,DonnéesProjet!AA41),DonnéesProjet!E41)","v":0.95},null,{"$f":"D13*E13","v":1049798.2872022532},null,null,null,null,null,null,null,null,null,null,null,null,null,null,null,null,null,null,null,null,"Fondations",{"$f":"D13","v":1105050.8286339508},{"$f":"E13","v":0.95}]
[null,null,"Édification",{"$f":"IF(DonnéesProjet!$B$20=\"O\",DonnéesParDéfaut!D25,DonnéesProjet!B42)","v":1821520.0211889176},{"$f":"IF(DonnéesProjet!$B$20=\"O\",IF(DonnéesProjet!AA$9=0,DonnéesParDéfaut!G25,DonnéesProjet!AA42),DonnéesProjet!E42)","v":0.75},null,{"$f":"D14*E14","v":1366140.0158916882},null,null,null,null,null,null,null,null,null,null,null,null,null,null,null,null,null,null,null,null,"Édification",{"$f":"D14","v":1821520.0211889176},{"$f":"E14","v":0.75}]
[null,null,"Électricité\n",{"$f":"IF(DonnéesProjet!$B$20=\"O\",DonnéesParDéfaut!D26,DonnéesProjet!B43)","v":2444157.5619438435},{"$f":"IF(DonnéesProjet!$B$20=\"O\",IF(DonnéesProjet!AA$9=0,DonnéesParDéfaut!G26,DonnéesProjet!AA43),DonnéesProjet!E43)","v":0.7},null,{"$f":"D15*E15","v":1710910.2933606904},null,null,null,null,null,null,null,null,null,null,null,null,null,null,null,null,null,null,null,null,"Électricité\n",2444157.5619438435,{"$f":"E15","v":0.7}]
[null,null,"Gestion / Encadrement\n",{"$f":"IF(DonnéesProjet!$B$20=\"O\",DonnéesParDéfaut!D27,DonnéesProjet!B44)","v":1341768.8448233332},{"$f":"IF(DonnéesProjet!$B$20=\"O\",IF(DonnéesProjet!AA$9=0,DonnéesParDéfaut!G27,DonnéesProjet!AA44),DonnéesProjet!E44)","v":0.1},null,{"$f":"D16*E16","v":134176.88448233332},null,null,null,null,null,null,null,null,null,null,null,null,null,null,null,null,null,null,null,null,"Gestion / Encadrement\n",1341768.8448233332,{"$f":"E16","v":0.1}]
[null,null,"Divers",{"$f":"IF(DonnéesProjet!$B$20=\"O\",DonnéesParDéfaut!D28,DonnéesProjet!B45)","v":7696049.7238209052},{"$f":"IF(DonnéesProjet!$B$20=\"O\",IF(DonnéesProjet!AA$9=0,DonnéesParDéfaut!G28,DonnéesProjet!AA45),DonnéesProjet!E45)","v":0.5},null,{"$f":"D17*E17","v":3848024.8619104526},null,null,null,null,null,null,null,null,null,null,null,null,null,null,null,null,null,null,null,null,"Divers",7696049.7238209052,{"$f":"E17","v":0.5}]
[null,null,"Sous-total pour la main-d'œuvre",{"$f":"SUM(D13:D17)","v":14408546.98041095},null,null,{"$f":"SUM(G13:G17)","v":8109050.342847418},{"$f":"SUM(G13:G16)","v":4261025.480936965},null,null,null,null,null,null,null,null,null,null,null,null,null,null,null,null,null,null,null,"Sous-total pour la main-d'œuvre",14408546.98041095]
[null,null,"Sous-total Services auxiliaires",{"$f":"D11+D18","v":46028504.820811436},null,null,{"$f":"G11+G18","v":33657297.760821126},null,null,null,null,null,null,null,null,null,null,null,null,null,null,null,null,null,null,null,null,"Sous-total Services auxiliaires",46028504.820811436]
[null,null,"Coûts de l'équipement",null,null,null,null,null,null,null,null,null,null,null,null,null,null,null,null,null,null,null,null,null,null,null,null,"Coûts de l'équipement"]
[null,null,"Turbines éoliennes et autres équipements (à l'exclusion des pales et des tours)\n",{"$f":"IF(DonnéesProjet!$B$20=\"O\",DonnéesParDéfaut!D32,DonnéesProjet!B28)","v":90235535.824108422},{"$f":"IF(DonnéesProjet!$B$20=\"O\",IF(DonnéesProjet!AA$9=0,DonnéesParDéfaut!G32,DonnéesProjet!AA28),DonnéesProjet!E28)","v":0},null,{"$f":"D21*E21","v":0},null,null,null,null,null,null,null,null,null,null,null,null,null,null,null,null,null,null,null,null,"Turbines éoliennes et autres équipements (à l'exclusion des pales et des tours)\n",{"$f":"D21","v":90235535.824108422},0]
[null,null,"Pales",{"$f":"IF(DonnéesProjet!$B$20=\"O\",DonnéesParDéfaut!D33,DonnéesProjet!B29)","v":21125376.279891599},{"$f":"IF(DonnéesProjet!$B$20=\"O\",IF(DonnéesProjet!AA$9=0,DonnéesParDéfaut!G33,DonnéesProjet!AA29),DonnéesProjet!E29)","v":0},null,{"$f":"D22*E22","v":0},null,null,null,null,null,null,null,null,null,null,null,null,null,null,null,null,null,null,null,null,"Pales",21125376.279891599,0]
[null,null,"Tours",{"$f":"IF(DonnéesProjet!$B$20=\"O\",DonnéesParDéfaut!D34,DonnéesProjet!B30)","v":23388809.452737126},{"$f":"IF(DonnéesProjet!$B$20=\"O\",IF(DonnéesProjet!AA$9=0,DonnéesParDéfaut!G34,DonnéesProjet!AA30),DonnéesProjet!E30)","v":0},null,{"$f":"D23*E23","v":0},null,null,null,null,null,null,null,null,null,null,null,null,null,null,null,null,null,null,null,null,"Tours",23388809.452737126,0]
[null,null,"Transport",{"$f":"IF(DonnéesProjet!$B$20=\"O\",DonnéesParDéfaut!D35,DonnéesProjet!B31)","v":16145823.299631439},{"$f":"IF(DonnéesProjet!$B$20=\"O\",IF(DonnéesProjet!AA$9=0,DonnéesParDéfaut!G35,DonnéesProjet!AA31),DonnéesProjet!E31)","v":0},null,{"$f":"D24*E24","v":0},null,null,null,null,null,null,null,null,null,null,null,null,null,null,null,null,null,null,null,null,"Transport",16145823.299631439,0]
[null,null,"Sous-otal pour l'équipement",{"$f":"SUM(D21:D24)","v":150895544.8563686},null,null,{"$f":"SUM(G21:G24)","v":0},0.89448733178325956,0.23449061099247084,0.10551266821674041,null,null,null,null,null,null,null,null,null,null,null,null,null,null,null,null,null,"Sous-otal pour l'équipement",{"$f":"D25","v":150895544.8563686}]
[null,null,"Coûts de développement et autres",null,null,null,null,"Main d'œuvre","Matériel","Conception",null,null,null,null,null,null,null,null,null,null,null,null,null,null,null,null,null,"Coûts de développement et autres"]
[null,null,"Sous-station/interconnexion HT",null,null,null,null,null,null,null,null,null,null,null,null,null,null,null,null,null,null,null,null,null,null,null,null,"Sous-station/interconnexion HT",{"$f":"D27","v":0},{"$f":"E27","v":0}]
[null,null,"Matériel",{"$f":"IF(DonnéesProjet!$B$20=\"O\",DonnéesParDéfaut!D39,DonnéesProjet!B49)","v":1498533.4877443062},{"$f":"IF(DonnéesProjet!$B$20=\"O\",IF(DonnéesProjet!AA$9=0,DonnéesParDéfaut!G39,DonnéesProjet!AA48),DonnéesProjet!E49)","v":0.9},null,{"$f":"D28*E28","v":1348680.1389698756},null,{"$f":"G28","v":1348680.1389698756},null,null,null,null,null,null,null,null,null,null,null,null,null,null,null,null,null,null,"Matériel",{"$f":"D28","v":1498533.4877443062},{"$f":"E28","v":0.9}]
[null,null,"Main-d'œuvre",{"$f":"IF(DonnéesProjet!$B$20=\"O\",DonnéesParDéfaut!D40,DonnéesProjet!B50)","v":459030.33741939464},{"$f":"IF(DonnéesProjet!$B$20=\"O\",IF(DonnéesProjet!AA$9=0,DonnéesParDéfaut!G40,DonnéesProjet!AA49),DonnéesProjet!E50)","v":0.1},null,45903.033741939464,{"$f":"G29*H25","v":41059.682172584362},null,{"$f":"G29*J25","v":4843.3515693550989},null,null,null,null,null,null,null,null,null,null,null,null,null,null,null,null,null,"Main-d'œuvre",459030.33741939464,0.1]
[null,null,"Ingénierie",{"$f":"IF(DonnéesProjet!$B$20=\"O\",DonnéesParDéfaut!D41,DonnéesProjet!B51)","v":2039128.9845455212},{"$f":"IF(DonnéesProjet!$B$20=\"O\",IF(DonnéesProjet!AA$9=0,DonnéesParDéfaut!G41,DonnéesProjet!AA50),DonnéesProjet!E51)","v":0},null,0,null,null,null,null,null,null,null,null,null,null,null,null,null,null,null,null,null,null,null,null,"Ingénierie",2039128.9845455212,0]
[null,null,"Services juridiques",{"$f":"IF(DonnéesProjet!$B$20=\"O\",DonnéesParDéfaut!D42,DonnéesProjet!B52)","v":1111325.296577309},{"$f":"IF(DonnéesProjet!$B$20=\"O\",IF(DonnéesProjet!AA$9=0,DonnéesParDéfaut!G42,DonnéesProjet!AA51),DonnéesProjet!E52)","v":1},null,1111325.296577309,null,{"$f":"I32-I33","v":2.2336998294967438},null,null,null,null,null,null,null,null,null,null,null,null,null,null,null,null,null,null,"Services juridiques",1111325.296577309,1]
[null,null,"Servitudes foncières",{"$f":"IF(DonnéesProjet!$B$20=\"O\",DonnéesParDéfaut!D43,DonnéesProjet!B53)","v":0},{"$f":"IF(DonnéesProjet!$B$20=\"O\",IF(DonnéesProjet!AA$9=0,DonnéesParDéfaut!G43,DonnéesProjet!AA52),DonnéesProjet!E53)","v":1},null,0,null,7.4929731707530101,null,null,null,{"$f":"CONCATENATE(\"En $\",Déflateurs!E5)","v":"En $2020"},null,null,null,null,null,null,null,null,null,null,null,null,null,null,"Servitudes foncières",0,1]
[null,null,"Permis/certificat d'implantation",{"$f":"IF(DonnéesProjet!$B$20=\"O\",DonnéesParDéfaut!D44,DonnéesProjet!B54)","v":519977.89105910808},{"$f":"IF(DonnéesProjet!$B$20=\"O\",IF(DonnéesProjet!AA$9=0,DonnéesParDéfaut!G44,DonnéesProjet!AA53),DonnéesProjet!E54)","v":1},null,519977.89105910808,"Ing. & Svcs Prof. & Interconnexion",{"$f":"I55","v":5.2592733412562662},{"$f":"I45-DonnéesParDéfaut!AQ28","v":0.13584326429120352},null,"Ing. & Svcs Prof. & Interconnexion",{"$f":"M55*G60","v":0.48019944877534443},{"$f":"M45-H45","v":3.8961742207561656E-2},null,"Ing. & Svcs Prof. & Interconnexion",{"$f":"Q55*G60","v":1.1161686481466639},{"$f":"(Q57-Q45-Q33)*G60","v":7.7364933407752687},null,"Ing. & Svcs Prof. & Interconnexion",{"$f":"U55*G60","v":0.71898981990518407},{"$f":"(U57-U33-U45)*K60","v":0},null,null,null,null,null,"Permis/certificat d'implantation",519977.89105910808,1]
[null,null,"Sous-total de coûts de développement et autres",{"$f":"SUM(D28:D33)","v":5627995.9973456394},null,null,{"$f":"SUM(G28:G33)","v":3025886.3603482321},"Autres secteurs (sauf construction)",{"$f":"I57-I45-I37-I33","v":34.664932572010137},null,null,"Autres secteurs (sauf construction)",{"$f":"((M57-M45)*G60)-M37-M33","v":1.6352579049010407},null,null,"Autres secteurs (sauf construction)",{"$f":"(Q57-Q45)*G60-Q33-Q37","v":3.8480248619104551},null,null,"Autres secteurs (sauf construction)",{"$f":"(U57-U45)*G60-U33-U37","v":2.5443760418533214},null,null,null,null,null,null,"Sous-total de coûts de développement et autres",5627995.9973456394]
[null,null,"Sous-total (ensemble des coûts sans les taxes)\n",{"$f":"D19+D25+D34","v":202552045.67452568},null,null,{"$f":"G19+G25+G34","v":36683184.121169358},null,null,null,null,null,null,null,null,null,null,null,null,null,null,null,null,null,null,null,null,"Sous-total (ensemble des coûts sans les taxes)\n",202552045.67452568]
[null,null,"Taxe de vente (achats de matériel et d'équipement)",{"$f":"IF(DonnéesProjet!$B$20=\"O\",DonnéesParDéfaut!D47,DonnéesProjet!B58)","v":0},{"$f":"IF(DonnéesProjet!$B$23=\"O\",IF(DonnéesProjet!#REF!=0,DonnéesParDéfaut!G47,DonnéesProjet!AA58),DonnéesProjet!E58)","v":1},null,{"$f":"D36*E36","v":0},null,null,null,null,null,null,null,null,null,null,null,null,null,null,null,null,null,null,null,null,"Taxe de vente (achats de matériel et d'équipement)",0,{"$f":"E36","v":1}]
[null,null,"Total",{"$f":"D35+D36","v":202552045.67452568},null,null,{"$f":"G19+G25+G34+G36","v":36683184.121169358},"Emplois manufacturiers",{"$f":"I46+I47+I48+I49","v":5.3096925492920279},{"$f":"J46+J47+J48+J49","v":8.2904626393128211},null,"Manuf. Salaires & Revenus",{"$f":"(M46+M47+M48+M49)*$G60","v":0.4557913488638195},null,null,"Production manuf.",{"$f":"(Q46+Q47+Q48+Q49)*$G60","v":3.9485698676111727},{"$f":"(R46+R47+R48+R49)*$G60","v":3.2272331377521044},null,"Production manuf.",{"$f":"(U46+U47+U48+U49)*$G60","v":1.2721195176427658},{"$f":"(V46+V47+V48+V49)*$G60","v":1.4092412827557961},null,null,null,null,null,"Total",202552045.67452568,{"$f":"AC37/(DonnéesProjet!B11*1000)","v":2025.5204567452568}]
[null,null,null,{"$f":"D37/(DonnéesParDéfaut!E5*1000)","v":2025.5204567452568},null,null,null,null,{"$f":"I39/DonnéesProjet!$B11","v":5.3096925492920277E-2},{"$f":"J39/DonnéesProjet!$B11","v":8.2904626393128206E-2},{"$f":"K39/DonnéesProjet!$B11","v":2.7944803321512321E-2},{"$f":"L39/DonnéesProjet!$B11","v":0.16394635520756079},null,null,null,{"$f":"P39*G60","v":1.1849592844045813},null,null,null,{"$f":"T39*G60","v":7.755408941231722},null,null,null,{"$f":"X39*G60","v":3.0413490704091171},null,null,null,null,null,null,null,null,"Retombées économiques locales - Résumé des résultats"]
[null,null,"Année",{"$f":"DonnéesProjet!B16","v":2020},null,{"$f":"CONCATENATE(\"Pour convertir en dollars de \",Déflateurs!E4)","v":"Pour convertir en dollars de 2017"},{"$f":"Déflateurs!J4","v":0.94890510948905105},null,{"$f":"SUM(I46:I49)","v":5.3096925492920279},{"$f":"SUM(J46:J49)","v":8.2904626393128211},{"$f":"SUM(K46:K49)","v":2.7944803321512319},16.394635520756079,0.43250273979778492,0.55277909713029172,0.13913208257991999,1.1244139195079967,3.7468181225507475,3.0623380139253547,0.54999103403575089,7.3591471705118527,1.2071207101719674,1.3372362537098794,0.34159470876913983,2.8859516726509868,null,null,null,"Coûts d'opération et de maintenance annuels de la centrale éolienne",null,null,null,null,null,"Emplois","Revenus d'emploi","Extrant","Valeur ajoutée"]
[null,null,"Demande locale - Coûts de construction",null,null,{"$f":"SUM(F3:F39)","v":0},null,null,{"$f":"(M45*10^6)/I45","v":70457.210276287544},null,null,null,{"$f":"CONCATENATE(\"In $\",Déflateurs!E4)","v":"In $2017"},null,null,null,null,null,null,null,null,null,null,null,null,null,null,null,null,null,null,null,"Durant la construction"]
[null,null,null,"Demande",null,"Total","Demande ajustée",null,"Emplois","Emplois","Emplois","Emplois","Revenus d'emploi",null,null,null,"Extrant",null,null,null,"Valeur ajoutée",null,null,null,null,null,null,"Coûts variables",null,null,null,null,"Retombées directes",{"$f":"AH42+AH43","v":63.198987058612772},{"$f":"AI42+AI43","v":4.7822846118848936},{"$f":"AJ42+AJ43","v":5.4182538112562124},{"$f":"AK42+AK43","v":11.898176099627831}]
[null,null,null,null,null,null,{"$f":"CONCATENATE(\"Millions de dollars de \",Déflateurs!E4)","v":"Millions de dollars de 2017"},{"$f":"H43/29","v":1343.5083519848897},"Direct","Indirect","Induit","Total","Direct","Indirect","Induit","Total","Direct","Indirect","Induit","Total","Direct","Indirect","Induit","Total",null,null,null,"Personnel",null,null,null,null,"Travaux de construction sur site et d'interconnexion",{"$f":"I45","v":57.939713717356504},{"$f":"M45*G60","v":4.3020851631095489},{"$f":"Q45*$G60","v":4.3020851631095489},{"$f":"U45*$G60","v":11.179186279722646}]
[null,null,"Agriculture",{"$f":"E141","v":0},null,{"$f":"D43","v":0},{"$f":"F43*G$39/10^6","v":0},{"$f":"H46*10^6","v":38961.742207561801},{"$f":"$G43*Multiplicateurs!D8","v":0},{"$f":"$G43*Multiplicateurs!E8","v":0},{"$f":"$G43*Multiplicateurs!F8","v":0},{"$f":"I43+J43+K43","v":0},{"$f":"$G43*Multiplicateurs!G8","v":0},{"$f":"$G43*Multiplicateurs!H8","v":0},{"$f":"$G43*Multiplicateurs!I8","v":0},{"$f":"M43+N43+O43","v":0},{"$f":"+$G43*Multiplicateurs!J8","v":0},{"$f":"$G43*Multiplicateurs!K8","v":0},{"$f":"$G43*Multiplicateurs!L8","v":0},{"$f":"Q43+R43+S43","v":0},{"$f":"$G43*Multiplicateurs!M8","v":0},{"$f":"$G43*Multiplicateurs!N8","v":0},{"$f":"$G43*Multiplicateurs!O8","v":0},{"$f":"U43+V43+W43","v":0},null,null,null,"Salaires du personnel de terrain (c.-à-d. techniciens sur place, etc.)",{"$f":"D66","v":358201.52175897441},1,null,null,"Services relatifs à la cosntruction (Ing. Et Svcs prof.)",{"$f":"I33","v":5.2592733412562662},{"$f":"M33","v":0.48019944877534443},{"$f":"Q33","v":1.1161686481466639},{"$f":"U33","v":0.71898981990518407}]
[null,null,"Exploitation minière",{"$f":"E142","v":0},null,{"$f":"D44","v":0},{"$f":"F44*G$39/10^6","v":0},"Const",{"$f":"$G44*Multiplicateurs!D9","v":0},{"$f":"$G44*Multiplicateurs!E9","v":0},{"$f":"$G44*Multiplicateurs!F9","v":0},{"$f":"I44+J44+K44","v":0},{"$f":"$G44*Multiplicateurs!G9","v":0},{"$f":"$G44*Multiplicateurs!H9","v":0},{"$f":"$G44*Multiplicateurs!I9","v":0},{"$f":"M44+N44+O44","v":0},{"$f":"+$G44*Multiplicateurs!J9","v":0},{"$f":"$G44*Multiplicateurs!K9","v":0},{"$f":"$G44*Multiplicateurs!L9","v":0},{"$f":"Q44+R44+S44","v":0},{"$f":"$G44*Multiplicateurs!M9","v":0},{"$f":"$G44*Multiplicateurs!N9","v":0},{"$f":"$G44*Multiplicateurs!O9","v":0},{"$f":"U44+V44+W44","v":0},null,null,null,"Administration",59934.572028101422,1,null,null,"Retombées indirectes",{"$f":"I34+I37+J57","v":187.00667646540444},{"$f":"M34+M37+N60","v":14.419541732306202},{"$f":"+Q34+Q37+R60","v":49.436916811453649},{"$f":"+U34+U37+V60","v":13.708308090508755}]
[null,null,"Construction",27250442.852441963,null,27250442.852441963,25.858084458521571,{"$f":"H18*G39/10^6","v":4.0433088505241273},{"$f":"+(H46*Multiplicateurs!D10)+DonnéesParDéfaut!AQ28","v":57.939713717356504},{"$f":"($G45*Multiplicateurs!E10)+(H47*Multiplicateurs!D10)","v":129.68086837310119},{"$f":"$G45*Multiplicateurs!F10","v":35.072215266901758},222.69279735735947,{"$f":"H45+H46","v":4.0822705927316889},{"$f":"(G45*Multiplicateurs!H10)+(H47*Multiplicateurs!G10)","v":10.578780180240205},{"$f":"$G45*Multiplicateurs!I10","v":1.7473781440770704},16.408428917048965,{"$f":"($H46*Multiplicateurs!J10)+(H45*Multiplicateurs!J10)","v":4.0822705927316889},{"$f":"G45*Multiplicateurs!K10+H47*Multiplicateurs!J10","v":34.636999678683182},{"$f":"$G45*Multiplicateurs!L10","v":6.8856027087275367},45.60487298014241,{"$f":"$G45*Multiplicateurs!M10","v":10.607986980758715},{"$f":"$G45*Multiplicateurs!N10","v":7.0099700072573299},{"$f":"$G45*Multiplicateurs!O10","v":4.2786019458232563},21.896558933839302,null,null,null,"Gestion",142852.72292674455,1,null,null,"Retombées induites",{"$f":"K57","v":45.510615183925971},{"$f":"O60","v":2.3905487705933388},{"$f":"S60","v":9.4159182793552496},{"$f":"W60","v":5.850939787306304}]
[null,null,"Secteur manufacturier",3948569.8676111726,null,3948569.8676111726,3.7468181225507475,{"$f":"H29/10^6*G39","v":3.8961742207561802E-2},{"$f":"$G46*Multiplicateurs!D11","v":5.3096925492920279},{"$f":"$G46*Multiplicateurs!E11","v":8.2904626393128211},{"$f":"$G46*Multiplicateurs!F11","v":2.7944803321512319},16.394635520756079,{"$f":"$G46*Multiplicateurs!G11","v":0.43250273979778492},{"$f":"$G46*Multiplicateurs!H11","v":0.55277909713029172},{"$f":"$G46*Multiplicateurs!I11","v":0.13913208257991999},1.1244139195079967,{"$f":"+$G46*Multiplicateurs!J11","v":3.7468181225507475},{"$f":"$G46*Multiplicateurs!K11","v":3.0623380139253547},{"$f":"$G46*Multiplicateurs!L11","v":0.54999103403575089},7.3591471705118527,{"$f":"$G46*Multiplicateurs!M11","v":1.2071207101719674},{"$f":"$G46*Multiplicateurs!N11","v":1.3372362537098794},{"$f":"$G46*Multiplicateurs!O11","v":0.34159470876913983},2.8859516726509868,null,null,null,"Sous-total pour la main-d'œuvre et le personnel",560988.81671382044,0,null,null,"Retombées totales (Directes, Indirectes, Induites)",{"$f":"AH45+AH44+AH41","v":295.71627870794316},{"$f":"AI45+AI44+AI41","v":21.592375114784435},{"$f":"AJ45+AJ44+AJ41","v":64.271088902065102},{"$f":"AK45+AK44+AK41","v":31.457423977442893}]
[null,null,"Fabrication de produits métalliques",0,null,0,0,{"$f":"G45-(H45+H46)","v":21.775813865789882},{"$f":"$G47*Multiplicateurs!D12","v":0},{"$f":"$G47*Multiplicateurs!E12","v":0},{"$f":"$G47*Multiplicateurs!F12","v":0},0,{"$f":"$G47*Multiplicateurs!G12","v":0},{"$f":"$G47*Multiplicateurs!H12","v":0},{"$f":"$G47*Multiplicateurs!I12","v":0},0,{"$f":"+$G47*Multiplicateurs!J12","v":0},{"$f":"$G47*Multiplicateurs!K12","v":0},{"$f":"$G47*Multiplicateurs!L12","v":0},0,{"$f":"$G47*Multiplicateurs!M12","v":0},{"$f":"$G47*Multiplicateurs!N12","v":0},{"$f":"$G47*Multiplicateurs!O12","v":0},0,null,null,null,"Services de garantie/maintenance",0,0]
[null,null,"Machinerie",0,null,0,0,null,{"$f":"$G48*Multiplicateurs!D13","v":0},{"$f":"$G48*Multiplicateurs!E13","v":0},{"$f":"$G48*Multiplicateurs!F13","v":0},0,{"$f":"$G48*Multiplicateurs!G13","v":0},{"$f":"$G48*Multiplicateurs!H13","v":0},{"$f":"$G48*Multiplicateurs!I13","v":0},0,{"$f":"+$G48*Multiplicateurs!J13","v":0},{"$f":"$G48*Multiplicateurs!K13","v":0},{"$f":"$G48*Multiplicateurs!L13","v":0},0,{"$f":"$G48*Multiplicateurs!M13","v":0},{"$f":"$G48*Multiplicateurs!N13","v":0},{"$f":"$G48*Multiplicateurs!O13","v":0},0,null,null,null,"TOTAL",{"$f":"D71","v":560988.81671382044},null,null,null,"Durant les années d'opération (annuellement)"]
[null,null,"Équipements électriques",0,null,0,0,null,{"$f":"$G49*Multiplicateurs!D14","v":0},{"$f":"$G49*Multiplicateurs!E14","v":0},{"$f":"$G49*Multiplicateurs!F14","v":0},0,{"$f":"$G49*Multiplicateurs!G14","v":0},{"$f":"$G49*Multiplicateurs!H14","v":0},{"$f":"$G49*Multiplicateurs!I14","v":0},0,{"$f":"+$G49*Multiplicateurs!J14","v":0},{"$f":"$G49*Multiplicateurs!K14","v":0},{"$f":"$G49*Multiplicateurs!L14","v":0},0,{"$f":"$G49*Multiplicateurs!M14","v":0},{"$f":"$G49*Multiplicateurs!N14","v":0},{"$f":"$G49*Multiplicateurs!O14","v":0},0,null,null,null,"Coûts fixes",null,null,null,null,"Retombées directes"]
[null,null,"TCSP (Transport, communications et services publiques)",0,null,0,0,null,{"$f":"$G50*Multiplicateurs!D15","v":0},{"$f":"$G50*Multiplicateurs!E15","v":0},{"$f":"$G50*Multiplicateurs!F15","v":0},0,{"$f":"$G50*Multiplicateurs!G15","v":0},{"$f":"$G50*Multiplicateurs!H15","v":0},{"$f":"$G50*Multiplicateurs!I15","v":0},0,{"$f":"+$G50*Multiplicateurs!J15","v":0},{"$f":"$G50*Multiplicateurs!K15","v":0},{"$f":"$G50*Multiplicateurs!L15","v":0},0,{"$f":"$G50*Multiplicateurs!M15","v":0},{"$f":"$G50*Multiplicateurs!N15","v":0},{"$f":"$G50*Multiplicateurs!O15","v":0},0,null,null,null,"Matériel et services",null,null,null,null,"Main d'œuvre sur site (techniciens, admin., gestion)",{"$f":"L137","v":6},{"$f":"P139","v":0.40952183620108884},{"$f":"T139","v":0.40952183620108884},{"$f":"X139","v":0.40952183620108884}]
[null,null,"Commerce de gros",0,null,0,0,null,{"$f":"$G51*Multiplicateurs!D16","v":0},{"$f":"$G51*Multiplicateurs!E16","v":0},{"$f":"$G51*Multiplicateurs!F16","v":0},0,{"$f":"$G51*Multiplicateurs!G16","v":0},{"$f":"$G51*Multiplicateurs!H16","v":0},{"$f":"$G51*Multiplicateurs!I16","v":0},0,{"$f":"+$G51*Multiplicateurs!J16","v":0},{"$f":"$G51*Multiplicateurs!K16","v":0},{"$f":"$G51*Multiplicateurs!L16","v":0},0,{"$f":"$G51*Multiplicateurs!M16","v":0},{"$f":"$G51*Multiplicateurs!N16","v":0},{"$f":"$G51*Multiplicateurs!O16","v":0},0,null,null,null,"Véhicules",{"$f":"D74","v":55392.406321559203},1,null,null,"Retombées indirectes",{"$f":"(L159-AH50)+M159","v":10.628753097976187},{"$f":"P160-AI50+Q160","v":0.7185354654589805},{"$f":"T160-AJ50+U160","v":2.2237716481410619},{"$f":"X160-AK50+Y160","v":1.2389170521292281}]
[null,null,"Commerce de détail",1924012.4309552263,null,1924012.4309552263,1.8257052264538642,null,{"$f":"$G52*Multiplicateurs!D17","v":20.479268375053792},{"$f":"$G52*Multiplicateurs!E17","v":3.2449503168861797},{"$f":"$G52*Multiplicateurs!F17","v":2.9533371214268467},26.677555813366816,{"$f":"$G52*Multiplicateurs!G17","v":0.75245761860068927},{"$f":"$G52*Multiplicateurs!H17","v":0.21248925704053273},{"$f":"$G52*Multiplicateurs!I17","v":0.14753583161753131},1.1124827072587533,{"$f":"+$G52*Multiplicateurs!J17","v":1.8257052264538642},{"$f":"$G52*Multiplicateurs!K17","v":0.74802972670114387},{"$f":"$G52*Multiplicateurs!L17","v":0.57922892088989697},3.1529638740449051,{"$f":"$G52*Multiplicateurs!M17","v":1.1162337330952758},{"$f":"$G52*Multiplicateurs!N17","v":0.42495489093380034},{"$f":"$G52*Multiplicateurs!O17","v":0.35995701054666768},1.9011456345757438,null,null,null,"Entretien du site et services divers",21603.038465408088,0.8,null,null,"Retombées induites",{"$f":"N159","v":2.2846882857498851},{"$f":"R160","v":0.12006962929745907},{"$f":"V160","v":0.47233224728258955},{"$f":"Z160","v":0.29339760830201722}]
[null,null,"FAI (Finances, assurances, immobilier)",0,null,0,0,null,{"$f":"$G53*Multiplicateurs!D18","v":0},{"$f":"$G53*Multiplicateurs!E18","v":0},{"$f":"$G53*Multiplicateurs!F18","v":0},0,{"$f":"$G53*Multiplicateurs!G18","v":0},{"$f":"$G53*Multiplicateurs!H18","v":0},{"$f":"$G53*Multiplicateurs!I18","v":0},0,{"$f":"+$G53*Multiplicateurs!J18","v":0},{"$f":"$G53*Multiplicateurs!K18","v":0},{"$f":"$G53*Multiplicateurs!L18","v":0},0,{"$f":"$G53*Multiplicateurs!M18","v":0},{"$f":"$G53*Multiplicateurs!N18","v":0},{"$f":"$G53*Multiplicateurs!O18","v":0},0,null,null,null,"Redevances, permis, autorisations",10801.519232704044,1,null,null,"Retombées totales (Directes, Indirectes, Induites)",{"$f":"SUM(AH50:AH52)","v":18.913441383726074},{"$f":"SUM(AI50:AI52)","v":1.2481269309575285},{"$f":"SUM(AJ50:AJ52)","v":3.1056257316247402},{"$f":"SUM(AK50:AK52)","v":1.9418364966323343}]
[null,null,"Services divers",1924012.4309552263,null,1924012.4309552263,1.8257052264538642,null,{"$f":"$G54*Multiplicateurs!D19","v":12.402603737353443},{"$f":"$G54*Multiplicateurs!E19","v":2.6780673769498318},{"$f":"$G54*Multiplicateurs!F19","v":2.2842718292783677},17.364942943581642,{"$f":"$G54*Multiplicateurs!G19","v":0.63127806946789855},{"$f":"$G54*Multiplicateurs!H19","v":0.15692186889013618},{"$f":"$G54*Multiplicateurs!I19","v":0.1144128752884891},0.90261281364652379,{"$f":"+$G54*Multiplicateurs!J19","v":1.8257052264538642},{"$f":"$G54*Multiplicateurs!K19","v":0.47946846390198383},{"$f":"$G54*Multiplicateurs!L19","v":0.44804914335264939},2.7532228337084974,{"$f":"$G54*Multiplicateurs!M19","v":1.2981376934808695},{"$f":"$G54*Multiplicateurs!N19","v":0.26482892787598589},{"$f":"$G54*Multiplicateurs!O19","v":0.27830155189835676},1.8412681732552121,null,null,null,"Services",43206.076930816176,1]
[null,null,"Services professionels",1116168.648146664,null,1116168.648146664,1.0591381332778562,null,{"$f":"$G55*Multiplicateurs!D20","v":5.2592733412562662},{"$f":"$G55*Multiplicateurs!E20","v":1.7327547551241167},{"$f":"$G55*Multiplicateurs!F20","v":1.6777790394039203},8.6698071357843034,{"$f":"$G55*Multiplicateurs!G20","v":0.4556637105167502},{"$f":"$G55*Multiplicateurs!H20","v":0.10656721343998186},{"$f":"$G55*Multiplicateurs!I20","v":8.373013479228468E-2},0.64596105874901666,{"$f":"+$G55*Multiplicateurs!J20","v":1.0591381332778562},{"$f":"$G55*Multiplicateurs!K20","v":0.33483850918984609},{"$f":"$G55*Multiplicateurs!L20","v":0.32906171519591482},1.723038357663617,{"$f":"$G55*Multiplicateurs!M20","v":0.68225311377864184},{"$f":"$G55*Multiplicateurs!N20","v":0.1925853973951811},{"$f":"$G55*Multiplicateurs!O20","v":0.20480317294934727},1.0796416841231702,null,null,null,"Assurances",415443.04741169396,0]
[null,null,"Gouvernement",519977.89105910808,null,519977.89105910808,0.49340967764732879,null,{"$f":"$G56*Multiplicateurs!D21","v":1.7830604596029072},{"$f":"$G56*Multiplicateurs!E21","v":1.4049478827281132},{"$f":"$G56*Multiplicateurs!F21","v":0.72853159476384155},3.9165399370948619,{"$f":"$G56*Multiplicateurs!G21","v":0.16796889322437039},{"$f":"$G56*Multiplicateurs!H21","v":9.1031888444067635E-2},{"$f":"$G56*Multiplicateurs!I21","v":3.6214874543493411E-2},0.29521565621193147,0,{"$f":"$G56*Multiplicateurs!K21","v":0.25103999191355292},{"$f":"$G56*Multiplicateurs!L21","v":0.14287944360980195},0.39391943552335484,0,{"$f":"$G56*Multiplicateurs!N21","v":0.15681597561356464},{"$f":"$G56*Multiplicateurs!O21","v":8.8728269500964768E-2},0.24554424511452941,null,null,null,"Carburant (pour les véhicules à moteur)",21603.038465408088,1]
[null,null,"Total",{"$f":"SUM(D43:D56)","v":36683184.121169366},null,{"$f":"SUM(F43:F56)","v":36683184.121169366},{"$f":"SUM(G43:G56)","v":34.808860844905226},"Total",{"$f":"SUM(I43:I56)","v":103.17361217991494},147.03205134410226,45.510615183925971,295.71627870794316,6.5221416243391825,11.698569505185215,2.2684039428987886,20.489115072423186,12.539637301468023,39.512714384315053,8.9348129658115507,60.987164651594647,14.91173223128547,9.3863914527857411,5.5519866594877332,29.850110343558946,null,null,null,"Produits, outils et fournitures diverses",140419.75002515258,1]
[null,null,null,null,null,null,null,null,null,null,null,null,null,null,null,null,null,null,null,null,null,null,null,null,null,null,null,"Inventaire des pièces de rechange, de l'équipement et des pièces détachées",1230542.3064334374,0.02]
[null,null,null,null,null,"Pour convertir en dollars de ",{"$f":"D39","v":2020},null,null,null,null,null,{"$f":"CONCATENATE(\"↓ Conversion des totax en dollars de \", G59,\"  ↓\")","v":"↓ Conversion des totax en dollars de 2020  ↓"},null,null,null,null,null,null,null,null,null,null,null,null,null,null,"Sous-total pour le matériel et les services",{"$f":"D82","v":1939011.1832861796}]
[null,null,null,null,null,null,{"$f":"Déflateurs!J5","v":1.0538461538461539},null,null,null,null,null,{"$f":"M57*$G60","v":6.8733338656497542},{"$f":"N57*$G60","v":12.328492478541342},2.3905487705933388,21.592375114784435,13.21484854077784,41.64032208193202,9.4159182793552496,64.271088902065131,15.714671659123919,9.8918125310126666,5.850939787306304,31.45742397744289,null,null,null,"Taxe de vente (achats de matériel et d'équipement)",{"$f":"D83","v":0},{"$f":"E83","v":1}]
[null,null,null,null,null,null,null,null,null,null,null,null,null,null,null,null,null,null,null,null,null,null,null,null,null,null,null,"Autres impôts et frais",{"$f":"D84","v":0},{"$f":"E84","v":1}]
[null,null,"Coûts d'opération et de maintenance annuels de la centrale éolienne",null,null,null,null,"Bénéfices brutes",null,null,null,null,null,null,null,null,null,null,null,null,null,null,null,null,null,null,null,"Total (taxes et autres frais inclus)",{"$f":"AC61+AC60+AC59+AC48","v":2500000}]
[null,null,null,"Coût","Part locale","Revenus employ.","Dépenses locales","Revenus employ.","Part gouvernementale","Part pour santé, ass., autres",null,null,null,null,null,null,null,null,null,null,null,null,null,null,null,null,null,"Paiement de la dette (moyenne annuelle)",{"$f":"D86","v":14706314.830296485},0]
[null,null,"Coûts variables",null,null,null,null,null,null,null,null,null,null,null,null,null,null,null,null,null,null,null,null,null,null,null,null,"Paiement du capital - Particuliers ",0,1]
[null,null,"Personnel",null,null,null,null,null,null,null,null,null,null,null,null,null,null,null,null,null,null,null,null,null,null,null,null,"Paiement du capital - Entreprises",4758337.4563682675,0]
[null,null,"Salaires du personnel de terrain (c.-à-d. techniciens sur place, etc.)",{"$f":"IF(DonnéesProjet!$B$20=\"O\",DonnéesParDéfaut!D55,DonnéesProjet!B66)","v":358201.52175897441},{"$f":"IF(DonnéesProjet!$B$20=\"O\",IF(DonnéesProjet!AA$9=0,DonnéesParDéfaut!G55,DonnéesProjet!AA66),DonnéesProjet!E66)","v":1},{"$f":"D66*(1-DonnéesParDéfaut!N$108)","v":237021.94694791335},{"$f":"E66*F66","v":237021.94694791335},{"$f":"D66*(1-DonnéesParDéfaut!N$108)","v":237021.94694791335},{"$f":"D66*E66*DonnéesParDéfaut!N$106","v":96714.410874923095},{"$f":"E66*D66*DonnéesParDéfaut!N$107","v":24465.163936137953},null,null,null,null,null,null,null,null,null,null,null,null,null,null,null,null,null,"Taxes foncières",555500,1]
[null,null,"Administration",{"$f":"IF(DonnéesProjet!$B$20=\"O\",DonnéesParDéfaut!D56,DonnéesProjet!B67)","v":59934.572028101422},{"$f":"IF(DonnéesProjet!$B$20=\"O\",IF(DonnéesProjet!AA$9=0,DonnéesParDéfaut!G56,DonnéesProjet!AA67),DonnéesProjet!E67)","v":1},{"$f":"D67*(1-DonnéesParDéfaut!N$108)","v":39658.706310994705},{"$f":"E67*F67","v":39658.706310994705},{"$f":"D67*(1-DonnéesParDéfaut!N$108)","v":39658.706310994705},{"$f":"D67*E67*DonnéesParDéfaut!N$106","v":16182.334447587386},{"$f":"E67*D67*DonnéesParDéfaut!N$107","v":4093.531269519327},null,null,null,null,null,null,null,null,null,null,null,null,null,null,null,null,null,"Location de terrain",330000,1]
[null,null,"Gestion",{"$f":"IF(DonnéesProjet!$B$20=\"O\",DonnéesParDéfaut!D57,DonnéesProjet!B68)","v":142852.72292674455},{"$f":"IF(DonnéesProjet!$B$20=\"O\",IF(DonnéesProjet!AA$9=0,DonnéesParDéfaut!G57,DonnéesProjet!AA68),DonnéesProjet!E68)","v":1},{"$f":"D68*(1-DonnéesParDéfaut!N$108)","v":94525.646760626856},{"$f":"E68*F68","v":94525.646760626856},{"$f":"D68*(1-DonnéesParDéfaut!N$108)","v":94525.646760626856},{"$f":"D68*E68*DonnéesParDéfaut!N$106","v":38570.235190221028},{"$f":"E68*D68*DonnéesParDéfaut!N$107","v":9756.8409758966536},null,null,null,null,null,null,null,null,null,null,null,null,null,null,null,null,null,"TOTAL",{"$f":"D91","v":22850152.28666475}]
[null,null,"Sous-total pour la main-d'œuvre et le personnel",{"$f":"SUM(D66:D68)","v":560988.81671382044},null,{"$f":"SUM(F66:F68)","v":371206.30001953495},{"$f":"SUM(G66:G68)","v":371206.30001953495},{"$f":"SUM(H66:H68)","v":371206.30001953495},{"$f":"SUM(I66:I68)","v":151466.9805127315},{"$f":"SUM(J66:J68)","v":38315.536181553936},{"$f":"G69+I69+J69","v":560988.81671382044}]
[null,null,"Services de garantie/maintenance",{"$f":"IF(DonnéesProjet!$B$20=\"O\",DonnéesParDéfaut!D59,DonnéesProjet!B70)","v":0},null,null,null,null,null,null,null,null,null,null,null,null,null,null,null,null,null,null,null,null,null,null,null,"Autres paramètres"]
[null,null,"TOTAL",{"$f":"D69+D70","v":560988.81671382044},null,null,null,null,null,null,null,null,null,null,null,null,null,null,null,null,null,null,null,null,null,null,null,null,null,"Local share"]
[null,null,"Coûts fixes",null,null,null,null,null,null,null,null,null,null,null,null,null,null,null,null,null,null,null,null,null,null,null,null,"Paramètres financiers"]
[null,null,"Matériel et services",null,null,null,null,null,null,null,null,null,null,null,null,null,null,null,null,null,null,null,null,null,null,null,null,"Financement par emprunt"]
[null,null,"Véhicules",{"$f":"IF(DonnéesProjet!$B$20=\"O\",DonnéesParDéfaut!D63,DonnéesProjet!B71)","v":55392.406321559203},{"$f":"IF(DonnéesProjet!$B$20=\"O\",IF(DonnéesProjet!AA$9=0,DonnéesParDéfaut!G63,DonnéesProjet!AA71),DonnéesProjet!E71)","v":1},null,{"$f":"D74*E74","v":55392.406321559203},null,null,null,null,null,null,null,null,null,null,null,null,null,null,null,null,null,null,null,null,"Pourcentage de financement",{"$f":"IF(DonnéesProjet!$B$20=\"O\",DonnéesParDéfaut!D84,DonnéesProjet!B88)","v":0.8},{"$f":"IF(DonnéesProjet!$B$20=\"O\",DonnéesParDéfaut!E84,DonnéesProjet!C88)","v":0}]
[null,null,"Entretien du site et services divers",{"$f":"IF(DonnéesProjet!$B$20=\"O\",DonnéesParDéfaut!D64,DonnéesProjet!B72)","v":21603.038465408088},{"$f":"IF(DonnéesProjet!$B$20=\"O\",IF(DonnéesProjet!AA$9=0,DonnéesParDéfaut!G64,DonnéesProjet!AA72),DonnéesProjet!E72)","v":0.8},null,{"$f":"D75*E75","v":17282.430772326472},null,null,null,null,null,null,null,null,null,null,null,null,null,null,null,null,null,null,null,null,"Années de financement (échéance)",{"$f":"IF(DonnéesProjet!$B$20=\"O\",DonnéesParDéfaut!D85,DonnéesProjet!B89)","v":20}]
[null,null,"Redevances, permis, autorisations",{"$f":"IF(DonnéesProjet!$B$20=\"O\",DonnéesParDéfaut!D65,DonnéesProjet!B73)","v":10801.519232704044},{"$f":"IF(DonnéesProjet!$B$20=\"O\",IF(DonnéesProjet!AA$9=0,DonnéesParDéfaut!G65,DonnéesProjet!AA73),DonnéesProjet!E73)","v":1},null,10801.519232704044,null,null,null,null,null,null,null,null,null,null,null,null,null,null,null,null,null,null,null,null,"Taux d'intérêt",{"$f":"IF(DonnéesProjet!$B$20=\"O\",DonnéesParDéfaut!D86,DonnéesProjet!B90)","v":6.5000000000000002E-2}]
[null,null,"Services",{"$f":"IF(DonnéesProjet!$B$20=\"O\",DonnéesParDéfaut!D66,DonnéesProjet!B74)","v":43206.076930816176},{"$f":"IF(DonnéesProjet!$B$20=\"O\",IF(DonnéesProjet!AA$9=0,DonnéesParDéfaut!G66,DonnéesProjet!AA74),DonnéesProjet!E74)","v":1},null,43206.076930816176,null,null,null,null,null,null,null,null,null,null,null,null,null,null,null,null,null,null,null,null,"Financement en fonds propres "]
[null,null,"Assurances",{"$f":"IF(DonnéesProjet!$B$20=\"O\",DonnéesParDéfaut!D67,DonnéesProjet!B75)","v":415443.04741169396},{"$f":"IF(DonnéesProjet!$B$20=\"O\",IF(DonnéesProjet!AA$9=0,DonnéesParDéfaut!G67,DonnéesProjet!AA75),DonnéesProjet!E75)","v":0},null,0,null,null,null,null,null,null,null,null,null,null,null,null,null,null,null,null,null,null,null,null,"Pourcentage de fonds propres",{"$f":"IF(DonnéesProjet!$B$20=\"O\",DonnéesParDéfaut!D89,DonnéesProjet!B92)","v":0.19999999999999996}]
[null,null,"Carburant (pour les véhicules à moteur)",{"$f":"IF(DonnéesProjet!$B$20=\"O\",DonnéesParDéfaut!D68,DonnéesProjet!B76)","v":21603.038465408088},{"$f":"IF(DonnéesProjet!$B$20=\"O\",IF(DonnéesProjet!AA$9=0,DonnéesParDéfaut!G68,DonnéesProjet!AA76),DonnéesProjet!E76)","v":1},null,21603.038465408088,null,null,null,null,null,null,null,null,null,null,null,null,null,null,null,null,null,null,null,null,"Investisseurs particuliers (pourcentage du capital total)",{"$f":"IF(DonnéesProjet!$B$20=\"O\",DonnéesParDéfaut!D90,DonnéesProjet!B93)","v":0},{"$f":"IF(DonnéesProjet!$B$20=\"O\",DonnéesParDéfaut!F87,DonnéesProjet!E93)","v":0}]
[null,null,"Produits, outils et fournitures diverses",{"$f":"IF(DonnéesProjet!$B$20=\"O\",DonnéesParDéfaut!D69,DonnéesProjet!B77)","v":140419.75002515258},{"$f":"IF(DonnéesProjet!$B$20=\"O\",IF(DonnéesProjet!AA$9=0,DonnéesParDéfaut!G69,DonnéesProjet!AA77),DonnéesProjet!E77)","v":1},null,140419.75002515258,null,null,null,null,null,null,null,null,null,null,null,null,null,null,null,null,null,null,null,null,"Sociétés d'investissement (pourcentage du capital total)",{"$f":"IF(DonnéesProjet!$B$20=\"O\",DonnéesParDéfaut!D91,DonnéesProjet!B94)","v":1},{"$f":"IF(DonnéesProjet!$B$20=\"O\",DonnéesParDéfaut!F88,DonnéesProjet!E94)","v":0}]
[null,null,"Inventaire des pièces de rechange, de l'équipement et des pièces détachées",{"$f":"IF(DonnéesProjet!$B$20=\"O\",DonnéesParDéfaut!D70,DonnéesProjet!B78)","v":1230542.3064334374},{"$f":"IF(DonnéesProjet!$B$20=\"O\",IF(DonnéesProjet!AA$9=0,DonnéesParDéfaut!G70,DonnéesProjet!AA78),DonnéesProjet!E78)","v":0.02},null,24610.846128668749,null,null,null,null,null,null,null,null,null,null,null,null,null,null,null,null,null,null,null,null,"Rendement des fonds propres (taux d'intérêt annuel)",{"$f":"IF(DonnéesProjet!$B$20=\"O\",DonnéesParDéfaut!D92,DonnéesProjet!B95)","v":0.1}]
[null,null,"Sous-total pour le matériel et les services",{"$f":"SUM(D74:D81)","v":1939011.1832861796},{"$f":"D82/(DonnéesParDéfaut!E5*1000)","v":19.390111832861795},null,{"$f":"SUM(G74:G81)","v":313316.06787663529},null,null,null,null,null,null,null,null,null,null,null,null,null,null,null,null,null,null,null,null,"Durée de remboursement (années)",{"$f":"IF(DonnéesProjet!$B$20=\"O\",DonnéesParDéfaut!D93,DonnéesProjet!B96)","v":20}]
[null,null,"Taxe de vente (achats de matériel et d'équipement)",{"$f":"IF(DonnéesProjet!$B$20=\"O\",DonnéesParDéfaut!D72,DonnéesProjet!B80)","v":0},{"$f":"IF(DonnéesProjet!$B$20=\"O\",IF(DonnéesProjet!AA$9=0,DonnéesParDéfaut!G72,DonnéesProjet!AA80),DonnéesProjet!E80)","v":1},null,{"$f":"D83*E83","v":0},null,null,null,null,null,null,null,null,null,null,null,null,null,null,null,null,null,null,null,null,"Paramètres fiscaux"]
[null,null,"Autres impôts et frais",{"$f":"IF(DonnéesProjet!$B$20=\"O\",DonnéesParDéfaut!D73,DonnéesProjet!B81)","v":0},{"$f":"IF(DonnéesProjet!$B$20=\"O\",IF(DonnéesProjet!AA$9=0,DonnéesParDéfaut!G73,DonnéesProjet!AA81),DonnéesProjet!E81)","v":1},null,{"$f":"D84*E84","v":0},null,null,null,null,null,null,null,null,null,null,null,null,null,null,null,null,null,null,null,null,"Taux local de l'impôt foncier (taux par mille - $/1 000 $)",{"$f":"IF(DonnéesProjet!$B$20=\"O\",DonnéesParDéfaut!D96,DonnéesProjet!B98)","v":"NA"}]
[null,null,null,null,null,null,null,null,null,null,null,null,null,null,null,null,null,null,null,null,null,null,null,null,null,null,null,"Valeur estimée (pourcentage du coût de construction)",{"$f":"IF(DonnéesProjet!$B$20=\"O\",DonnéesParDéfaut!D97,DonnéesProjet!B99)","v":"NA"}]
[null,null,"Paiement de la dette (moyenne annuelle)",{"$f":"IF(DonnéesProjet!$B$20=\"O\",F197,Calculs!F233)","v":14706314.830296485},{"$f":"IF(DonnéesProjet!$B$20=\"O\",DonnéesParDéfaut!G84,DonnéesProjet!E88)","v":0},null,{"$f":"D86*E86","v":0},{"$f":"IF(DonnéesProjet!$B$20=\"O\",Calculs!D197,D233)*E86","v":0},"Paiement de la dette - intérêt annuel moy. de la part locale",null,null,null,null,null,null,null,null,null,null,null,null,null,null,null,null,null,null,"Valeur imposable",{"$f":"IF(DonnéesProjet!$B$20=\"O\",DonnéesParDéfaut!D98,DonnéesProjet!B100)","v":"NA"}]
[null,null,"Paiement du capital - Particuliers ",{"$f":"IF(DonnéesProjet!$B$20=\"O\",K197,Calculs!K233)","v":0},{"$f":"IF(DonnéesProjet!$B$20=\"O\",DonnéesParDéfaut!G90,DonnéesProjet!E93)","v":1},null,{"$f":"D87*E87","v":0},{"$f":"IF(DonnéesProjet!$B$20=\"O\",Calculs!I197,I233)*E87","v":0},"Paiement du capital- intérêt annuel moy. (particuliers)",null,null,null,null,null,null,null,null,null,null,null,null,null,null,null,null,null,null,"Taxes par MW",{"$f":"IF(DonnéesProjet!$B$20=\"O\",DonnéesParDéfaut!D99,DonnéesProjet!B101)","v":5555}]
[null,null,"Paiement du capital - Entreprises",{"$f":"IF(DonnéesProjet!$B$20=\"O\",P197,Calculs!P233)","v":4758337.4563682675},{"$f":"IF(DonnéesProjet!$B$20=\"O\",DonnéesParDéfaut!G91,DonnéesProjet!E94)","v":0},null,{"$f":"D88*E88","v":0},{"$f":"IF(DonnéesProjet!$B$20=\"O\",Calculs!N197,N233)*E88","v":0},"Paiement du capital - intérêt annuel moy. (entreprises)",null,null,"Coût de location de terrain par défaut (ci-dessous)",null,null,"Coût de location de terrain révisé (ci-dessous)",null,null,null,null,null,null,null,null,null,null,null,null,"Impôts locaux",{"$f":"IF(DonnéesProjet!$B$20=\"O\",DonnéesParDéfaut!D100,DonnéesProjet!B102)","v":555500},{"$f":"IF(DonnéesProjet!$B$20=\"O\",DonnéesParDéfaut!G100,DonnéesProjet!E102)","v":1}]
[null,null,"Taxes foncières",{"$f":"IF(DonnéesProjet!$B$20=\"O\",IF(DonnéesParDéfaut!D100=\"NA\",0,DonnéesParDéfaut!D100),DonnéesProjet!B102)","v":555500},{"$f":"IF(DonnéesProjet!$B$20=\"O\",DonnéesParDéfaut!G100,DonnéesProjet!E102)","v":1},null,{"$f":"D89*E89","v":555500},null,null,null,null,"M","A",null,"M","A",null,null,null,null,null,null,null,null,null,null,null,"Taux local de la taxe de vente",{"$f":"IF(DonnéesProjet!$B$20=\"O\",DonnéesParDéfaut!D101,DonnéesProjet!B103)","v":0},{"$f":"IF(DonnéesProjet!$B$20=\"O\",DonnéesParDéfaut!G101,DonnéesProjet!E103)","v":1}]
[null,null,"Location de terrain",{"$f":"IF(DonnéesProjet!$B$20=\"O\",DonnéesParDéfaut!D78,DonnéesProjet!B107)","v":330000},{"$f":"IF(DonnéesProjet!$B$20=\"M\",DonnéesParDéfaut!G105,DonnéesProjet!E108)","v":1},null,{"$f":"D90*E90","v":330000},{"$f":"IF(DonnéesProjet!B20=\"O\",Calculs!L90,O90)","v":330000},"To House",{"$f":"IF(DonnéesProjet!B20=\"O\",Calculs!M90,P90)","v":0},"To FIRE",{"$f":"DonnéesParDéfaut!D104*DonnéesParDéfaut!G105","v":330000},0,null,{"$f":"IF(DonnéesProjet!B20=\"N\",IF(DonnéesProjet!B108=\"M\",Calculs!G90,0),0)","v":0},{"$f":"IF(DonnéesProjet!B20=\"N\",IF(DonnéesProjet!B108=\"A\",Calculs!G90,0),0)","v":0},null,null,null,null,null,null,null,null,null,null,null,"Paramètres des baux fonciers"]
[null,null,"TOTAL",{"$f":"D69+SUM(D82:D90)","v":22850152.28666475},null,null,{"$f":"G69+SUM(G82:G90)+I69+J69","v":1759804.8845904558},null,null,null,null,null,null,null,null,null,null,null,null,null,null,null,null,null,null,null,null,"Coût de location du terrain (par éolienne)",{"$f":"IF(DonnéesProjet!$B$20=\"O\",DonnéesParDéfaut!D103,DonnéesProjet!B105)","v":8250}]
[null,null,"Total (sans coût de la dette, du capital, des taxes fonc., des loyers de terrain)",{"$f":"D82+D83+D84+D71","v":2500000},{"$f":"D91-D92","v":20350152.28666475},null,{"$f":"G69+I69+J69+G82","v":874304.8845904558},{"$f":"G91-G92","v":885500},null,null,null,null,null,null,null,null,null,null,null,null,null,null,null,null,null,null,null,"Location du terrain (coût total)",{"$f":"IF(DonnéesProjet!$B$20=\"O\",DonnéesParDéfaut!D104,DonnéesProjet!B107)","v":330000}]
[null,null,"Coût total par kW",{"$f":"D92/(DonnéesProjet!B11*1000)","v":25},null,null,null,null,null,null,null,null,null,null,null,null,null,null,null,null,null,null,null,null,null,null,null,"Bénéficiaire du paiement du bail (M = ménage/agriculteur, A = autre)",{"$f":"IF(DonnéesProjet!$B$20=\"O\",DonnéesParDéfaut!D105,DonnéesProjet!B108)","v":"M"},{"$f":"IF(DonnéesProjet!$B$20=\"O\",DonnéesParDéfaut!F105,DonnéesProjet!E108)","v":0}]
[null,null,null,"Local Share",1,0.5,null,null,null,null,null,"Sans les employés de centrale",null,null,null,null,null,null,null,null,null,null,null,null,null,null,null,null,"Taux horaire de base","Salaire annuel","Charges salariales"]
[null,null,"Demande locale - Coûts annuels d'opération et de maintenance - avec marges",null,null,null,null,null,null,null,null,null,null,null,{"$f":"Déflateurs!E4","v":2017},"Dollars",null,null,null,null,null,null,null,null,null,null,null,"Main-d'œuvre en construction"]
[null,null,null,"Demande","DPC-location terrain","DPC-Capital","Total","Demande ajustée  - Million",null,null,null,"Emplois",null,null,null,"Revenus d'emploi",null,null,null,"Extrant",null,null,null,"Valeur ajoutée",null,null,null,"Fondations",{"$f":"IF(DonnéesProjet!$B$20=\"O\",DonnéesParDéfaut!F110,DonnéesProjet!B111)","v":17.39154557556369},{"$f":"AC96*40*52","v":36174.414797172474},{"$f":"IF(DonnéesProjet!$B$20=\"O\",DonnéesParDéfaut!H110,DonnéesProjet!D111)","v":0.33830000000000005}]
[null,null,null,null,"À une ferme / un ménage","À des particuliers","sans Employ. Centrale",{"$f":"Déflateurs!E4","v":2017},"Dollars",null,null,"Direct","Indirect","Induit","Total","Direct","Indirect","Induit","Total","Direct","Indirect","Induit","Total","Direct","Indirect","Induit","Total","Édification",{"$f":"IF(DonnéesProjet!$B$20=\"O\",DonnéesParDéfaut!F111,DonnéesProjet!B112)","v":28.667503470831306},{"$f":"AC97*40*52","v":59628.407219329121},{"$f":"IF(DonnéesProjet!$B$20=\"O\",DonnéesParDéfaut!H111,DonnéesProjet!D112)","v":0.33830000000000005}]
[null,null,"Agriculture",{"$f":"MMULT(TRANSPOSE(DemandOM),MarginsAGR)","v":0},{"$f":"H$90*Multiplicateurs!D25*E$94","v":4232.8279631577288},{"$f":"H$87*Multiplicateurs!D25*F$94","v":0},{"$f":"D98+E98+F98","v":4232.8279631577288},{"$f":"G98*G$39/10^6","v":4.0165520818285019E-3},null,null,null,{"$f":"$H98*Multiplicateurs!D8","v":9.2141823033410186E-3},{"$f":"$H98*Multiplicateurs!E8","v":7.9328614493062635E-3},{"$f":"$H98*Multiplicateurs!F8","v":2.0722964226203384E-3},{"$f":"L98+M98+N98","v":1.9219340175267621E-2},{"$f":"$H98*Multiplicateurs!G8","v":2.9352615499896213E-4},{"$f":"$H98*Multiplicateurs!H8","v":4.7700562882009351E-4},{"$f":"$H98*Multiplicateurs!I8","v":1.0512782017853156E-4},{"$f":"P98+Q98+R98","v":8.7565960399758717E-4},{"$f":"$H98*Multiplicateurs!J8","v":4.0165520818285019E-3},{"$f":"$H98*Multiplicateurs!K8","v":2.3598027308264044E-3},{"$f":"$H98*Multiplicateurs!L8","v":4.0987385873344996E-4},{"$f":"T98+U98+V98","v":6.7862286713883556E-3},{"$f":"$H98*Multiplicateurs!M8","v":1.8560928223978485E-3},{"$f":"$H98*Multiplicateurs!N8","v":1.0429162000456162E-3},{"$f":"$H98*Multiplicateurs!O8","v":2.5352688060886487E-4},{"$f":"X98+Y98+Z98","v":3.1525359030523297E-3},"Électricité\n",{"$f":"IF(DonnéesProjet!$B$20=\"O\",DonnéesParDéfaut!F112,DonnéesProjet!B113)","v":34.969742839754012},{"$f":"AC98*40*52","v":72737.065106688344},{"$f":"IF(DonnéesProjet!$B$20=\"O\",DonnéesParDéfaut!H112,DonnéesProjet!D113)","v":0.33830000000000005}]
[null,null,"Exploitation minière",{"$f":"MMULT(TRANSPOSE(DemandOM),MarginsMIN)","v":0},{"$f":"H$90*Multiplicateurs!D26*E$94","v":1054.5187487806641},{"$f":"H$87*Multiplicateurs!D26*F$94","v":0},{"$f":"D99+E99+F99","v":1054.5187487806641},{"$f":"G99*G$39/10^6","v":1.0006382287699731E-3},null,null,null,{"$f":"$H99*Multiplicateurs!D9","v":7.1439982096237415E-4},{"$f":"$H99*Multiplicateurs!E9","v":1.6620447727863448E-3},{"$f":"$H99*Multiplicateurs!F9","v":8.0575211960207777E-4},{"$f":"L99+M99+N99","v":3.1821967133507964E-3},{"$f":"$H99*Multiplicateurs!G9","v":1.3333204400097135E-4},{"$f":"$H99*Multiplicateurs!H9","v":1.3730747759004881E-4},{"$f":"$H99*Multiplicateurs!I9","v":4.0264061796509464E-5},{"$f":"P99+Q99+R99","v":3.1090358338752965E-4},{"$f":"$H99*Multiplicateurs!J9","v":1.0006382287699731E-3},{"$f":"$H99*Multiplicateurs!K9","v":4.1780485465182281E-4},{"$f":"$H99*Multiplicateurs!L9","v":1.5872984406077752E-4},{"$f":"T99+U99+V99","v":1.5771729274825733E-3},{"$f":"$H99*Multiplicateurs!M9","v":5.4200045699354571E-4},{"$f":"$H99*Multiplicateurs!N9","v":2.3378043555563315E-4},{"$f":"$H99*Multiplicateurs!O9","v":9.8199584249733486E-5},{"$f":"X99+Y99+Z99","v":8.7398047679891231E-4},"Gestion / Encadrement\n",{"$f":"IF(DonnéesProjet!$B$20=\"O\",DonnéesParDéfaut!F113,DonnéesProjet!B114)","v":33.849832707994224},{"$f":"AC99*40*52","v":70407.652032627986},{"$f":"IF(DonnéesProjet!$B$20=\"O\",DonnéesParDéfaut!H113,DonnéesProjet!D114)","v":0.33830000000000005}]
[null,null,"Construction",{"$f":"MMULT(TRANSPOSE(DemandOM),MarginsCON)","v":0},{"$f":"H$90*Multiplicateurs!D27*E$94","v":180.41094942520655},{"$f":"H$87*Multiplicateurs!D27*F$94","v":0},180.41094942520655,1.7119287171734929E-4,null,null,null,{"$f":"$H100*Multiplicateurs!D10","v":5.9687778830784066E-4},{"$f":"$H100*Multiplicateurs!E10","v":3.559018712131267E-4},{"$f":"$H100*Multiplicateurs!F10","v":2.3219481932859522E-4},1.1849744788495625E-3,{"$f":"$H100*Multiplicateurs!G10","v":5.042829748494675E-5},{"$f":"$H100*Multiplicateurs!H10","v":2.75695030644887E-5},{"$f":"$H100*Multiplicateurs!I10","v":1.1568478049506261E-5},8.9566278598941716E-5,{"$f":"$H100*Multiplicateurs!J10","v":1.7119287171734929E-4},{"$f":"$H100*Multiplicateurs!K10","v":8.514719396680009E-5},{"$f":"$H100*Multiplicateurs!L10","v":4.5585979236113208E-5},3.019260449202626E-4,{"$f":"$H100*Multiplicateurs!M10","v":7.0229941327996123E-5},{"$f":"$H100*Multiplicateurs!N10","v":4.6409350163576773E-5},{"$f":"$H100*Multiplicateurs!O10","v":2.832638880176356E-5},1.4496568029333647E-4,"Main-d'œuvre en O&M","Taux horaire de base","Salaire annuel","Charges salariales"]
[null,null,"Secteur manufacturier",{"$f":"MMULT(TRANSPOSE(DemandOM),MarginsMFG)","v":16198.977359964176},{"$f":"H$90*Multiplicateurs!D28*E$94","v":62799.4321820529},{"$f":"H$87*Multiplicateurs!D28*F$94","v":0},78998.409542017078,7.4961994455928604E-2,null,null,null,{"$f":"$H101*Multiplicateurs!D11","v":0.10623017462394146},{"$f":"$H101*Multiplicateurs!E11","v":0.1658659678901544},{"$f":"$H101*Multiplicateurs!F11","v":5.5908723699487482E-2},0.32800486621358332,{"$f":"$H101*Multiplicateurs!G11","v":8.6530135497540073E-3},{"$f":"$H101*Multiplicateurs!H11","v":1.1059363507675281E-2},{"$f":"$H101*Multiplicateurs!I11","v":2.7835934549973614E-3},2.2495970512426647E-2,{"$f":"$H101*Multiplicateurs!J11","v":7.4961994455928604E-2},{"$f":"$H101*Multiplicateurs!K11","v":6.1267709750953532E-2},{"$f":"$H101*Multiplicateurs!L11","v":1.1003583172628362E-2},0.1472332873795105,{"$f":"$H101*Multiplicateurs!M11","v":2.4150672123349655E-2},{"$f":"$H101*Multiplicateurs!N11","v":2.6753873115309995E-2},{"$f":"$H101*Multiplicateurs!O11","v":6.8342310268037264E-3},5.7738776265463379E-2,"Salaires du personnel de terrain (c.-à-d. techniciens sur place, etc.)",{"$f":"IF(DonnéesProjet!$B$20=\"O\",DonnéesParDéfaut!F115,DonnéesProjet!B116)","v":32.169967510354553},{"$f":"AC101*40*52","v":66913.532421537471},{"$f":"IF(DonnéesProjet!$B$20=\"O\",DonnéesParDéfaut!H115,DonnéesProjet!D116)","v":0.33830000000000005}]
[null,null,"Fabrication de produits métalliques",{"$f":"MMULT(TRANSPOSE(DemandOM),MarginsFME)","v":0},{"$f":"H$90*Multiplicateurs!D29*E$94","v":75.856530903525652},{"$f":"H$87*Multiplicateurs!D29*F$94","v":0},75.856530903525652,7.198064976246959E-5,null,null,null,{"$f":"$H102*Multiplicateurs!D12","v":2.1602877850077377E-4},{"$f":"$H102*Multiplicateurs!E12","v":1.1418272630540309E-4},{"$f":"$H102*Multiplicateurs!F12","v":8.1968225232470694E-5},4.1217973003864752E-4,{"$f":"$H102*Multiplicateurs!G12","v":1.8743656768365451E-5},{"$f":"$H102*Multiplicateurs!H12","v":8.6633896959487823E-6},{"$f":"$H102*Multiplicateurs!I12","v":4.1050754543846656E-6},3.1512121918698897E-5,{"$f":"$H102*Multiplicateurs!J12","v":7.198064976246959E-5},{"$f":"$H102*Multiplicateurs!K12","v":2.8547261728464398E-5},{"$f":"$H102*Multiplicateurs!L12","v":1.6101727615758708E-5},1.1662963910669271E-4,{"$f":"$H102*Multiplicateurs!M12","v":2.5814758497844303E-5},{"$f":"$H102*Multiplicateurs!N12","v":1.4256525488816774E-5},{"$f":"$H102*Multiplicateurs!O12","v":9.995430560427982E-6},5.0066714547089065E-5,"Administration",{"$f":"IF(DonnéesProjet!$B$20=\"O\",DonnéesParDéfaut!F116,DonnéesProjet!B117)","v":21.53082125863661},{"$f":"AC102*40*52","v":44784.108217964145},{"$f":"IF(DonnéesProjet!$B$20=\"O\",DonnéesParDéfaut!H116,DonnéesProjet!D117)","v":0.33830000000000005}]
[null,null,"Machinerie",{"$f":"MMULT(TRANSPOSE(DemandOM),MarginsMAC)","v":0},{"$f":"H$90*Multiplicateurs!D30*E$94","v":955.84908813831601},{"$f":"H$87*Multiplicateurs!D30*F$94","v":0},955.84908813831601,9.0701008363489836E-4,null,null,null,{"$f":"$H103*Multiplicateurs!D13","v":2.5330599725376692E-3},{"$f":"$H103*Multiplicateurs!E13","v":1.393393939981125E-3},{"$f":"$H103*Multiplicateurs!F13","v":1.0115833056890458E-3},4.93803721820784E-3,{"$f":"$H103*Multiplicateurs!G13","v":2.2555003656455803E-4},{"$f":"$H103*Multiplicateurs!H13","v":1.0783505250473376E-4},{"$f":"$H103*Multiplicateurs!I13","v":5.0713915119186877E-5},3.8409900418847866E-4,{"$f":"$H103*Multiplicateurs!J13","v":9.0701008363489836E-4},{"$f":"$H103*Multiplicateurs!K13","v":3.4313458088611681E-4},{"$f":"$H103*Multiplicateurs!L13","v":1.9879909334841119E-4},1.4489437578694263E-3,{"$f":"$H103*Multiplicateurs!M13","v":3.5669204552792906E-4},{"$f":"$H103*Multiplicateurs!N13","v":1.7738754030891449E-4},{"$f":"$H103*Multiplicateurs!O13","v":1.2326592263420881E-4},6.5734550847105242E-4,"Gestion / Encadrement\n",{"$f":"IF(DonnéesProjet!$B$20=\"O\",DonnéesParDéfaut!F117,DonnéesProjet!B118)","v":51.318234861227701},{"$f":"AC103*40*52","v":106741.92851135362},{"$f":"IF(DonnéesProjet!$B$20=\"O\",DonnéesParDéfaut!H117,DonnéesProjet!D118)","v":0.33830000000000005}]
[null,null,"Équipements électriques",{"$f":"MMULT(TRANSPOSE(DemandOM),MarginsEEQ)","v":5472.1409862694763},{"$f":"H$90*Multiplicateurs!D31*E$94","v":1380.4268426560623},{"$f":"H$87*Multiplicateurs!D31*F$94","v":0},6852.5678289255384,6.5024366259877368E-3,null,null,null,{"$f":"$H104*Multiplicateurs!D14","v":1.6983502830460972E-2},{"$f":"$H104*Multiplicateurs!E14","v":6.3200689086689785E-3},{"$f":"$H104*Multiplicateurs!F14","v":5.5538834228973377E-3},2.8857455162027288E-2,{"$f":"$H104*Multiplicateurs!G14","v":1.3978551521069834E-3},{"$f":"$H104*Multiplicateurs!H14","v":4.4632760212255955E-4},{"$f":"$H104*Multiplicateurs!I14","v":2.7538087877700243E-4},2.1195636330065453E-3,{"$f":"$H104*Multiplicateurs!J14","v":6.5024366259877368E-3},{"$f":"$H104*Multiplicateurs!K14","v":1.4169131708645015E-3},{"$f":"$H104*Multiplicateurs!L14","v":1.0897589558609914E-3},9.0091087527132286E-3,{"$f":"$H104*Multiplicateurs!M14","v":2.529536426679713E-3},{"$f":"$H104*Multiplicateurs!N14","v":7.6342840128001922E-4},{"$f":"$H104*Multiplicateurs!O14","v":6.7816076492010287E-4},3.9711255928798353E-3]
[null,null,"TCSP",{"$f":"MMULT(TRANSPOSE(DemandOM),MarginsTCPU)","v":43938.607274079193},{"$f":"H$90*Multiplicateurs!D32*E$94","v":15377.955052590205},{"$f":"H$87*Multiplicateurs!D32*F$94","v":0},59316.562326669402,5.6285789069102352E-2,null,null,null,{"$f":"$H105*Multiplicateurs!D15","v":0.17256009389044874},{"$f":"$H105*Multiplicateurs!E15","v":9.2142427541931443E-2},{"$f":"$H105*Multiplicateurs!F15","v":6.4219116333101373E-2},0.32892163776548156,{"$f":"$H105*Multiplicateurs!G15","v":1.5365297606308056E-2},{"$f":"$H105*Multiplicateurs!H15","v":6.717999082702571E-3},{"$f":"$H105*Multiplicateurs!I15","v":3.2051335913868234E-3},2.5288430280397452E-2,{"$f":"$H105*Multiplicateurs!J15","v":5.6285789069102352E-2},{"$f":"$H105*Multiplicateurs!K15","v":2.5592348296583623E-2},{"$f":"$H105*Multiplicateurs!L15","v":1.2609281705771141E-2},9.4487419071457107E-2,{"$f":"$H105*Multiplicateurs!M15","v":3.3959921087243626E-2},{"$f":"$H105*Multiplicateurs!N15","v":1.2433356075675627E-2},{"$f":"$H105*Multiplicateurs!O15","v":7.8199967371368265E-3},5.4213273900056078E-2]
[null,null,"Commerce de gros",{"$f":"MMULT(TRANSPOSE(DemandOM),MarginsWHO)","v":2753.053277673841},{"$f":"H$90*Multiplicateurs!D33*E$94","v":13037.453403588544},{"$f":"H$87*Multiplicateurs!D33*F$94","v":0},15790.506681262385,1.4983692471270875E-2,null,null,null,{"$f":"$H106*Multiplicateurs!D16","v":7.0320705389754018E-2},{"$f":"$H106*Multiplicateurs!E16","v":2.2967404074390341E-2},{"$f":"$H106*Multiplicateurs!F16","v":2.2482872904302002E-2},0.11577098236844635,{"$f":"$H106*Multiplicateurs!G16","v":5.8428133589516354E-3},{"$f":"$H106*Multiplicateurs!H16","v":1.5661445211519246E-3},{"$f":"$H106*Multiplicateurs!I16","v":1.1237685676612275E-3},8.5327264477647879E-3,{"$f":"$H106*Multiplicateurs!J16","v":1.4983692471270875E-2},{"$f":"$H106*Multiplicateurs!K16","v":5.2619406055836133E-3},{"$f":"$H106*Multiplicateurs!L16","v":4.4100724046786961E-3},2.4655705481533181E-2,{"$f":"$H106*Multiplicateurs!M16","v":9.4523877183684494E-3},{"$f":"$H106*Multiplicateurs!N16","v":2.8965686073084071E-3},{"$f":"$H106*Multiplicateurs!O16","v":2.7397469027484085E-3},1.5088703228425265E-2]
[null,null,"Commerce de détail",{"$f":"MMULT(TRANSPOSE(DemandOM),MarginsRET)","v":217415.19481211988},{"$f":"H$90*Multiplicateurs!D34*E$94","v":41583.635115525809},{"$f":"H$87*Multiplicateurs!D34*F$94","v":0},258998.82992764568,0.24576531307002872,null,null,null,{"$f":"$H107*Multiplicateurs!D17","v":2.7567943229347049},{"$f":"$H107*Multiplicateurs!E17","v":0.43681543930025751},{"$f":"$H107*Multiplicateurs!F17","v":0.39756024780550636},3.5911700100404689,{"$f":"$H107*Multiplicateurs!G17","v":0.10129125968846528},{"$f":"$H107*Multiplicateurs!H17","v":2.8604009028345739E-2},{"$f":"$H107*Multiplicateurs!I17","v":1.9860374676670674E-2},0.14975564339348169,{"$f":"$H107*Multiplicateurs!J17","v":0.24576531307002872},{"$f":"$H107*Multiplicateurs!K17","v":0.10069520386129009},{"$f":"$H107*Multiplicateurs!L17","v":7.7972267931894282E-2},0.42443278486321306,{"$f":"$H107*Multiplicateurs!M17","v":0.15026058363558054},{"$f":"$H107*Multiplicateurs!N17","v":5.7204838052548862E-2},{"$f":"$H107*Multiplicateurs!O17","v":4.8455219444478559E-2},0.25592064113260793]
[null,null,"FAI",{"$f":"MMULT(TRANSPOSE(DemandOM),MarginsFIRE)","v":38315.536181553936},{"$f":"H$90*Multiplicateurs!D35*E$94","v":46975.85480823103},{"$f":"H$87*Multiplicateurs!D35*F$94","v":0},85291.390989784966,8.0933436705635367E-2,null,null,null,{"$f":"($H108-(($H86+$H88)*$G39/10^6))*Multiplicateurs!D18","v":0.22076617843261243},{"$f":"$H108*Multiplicateurs!E18","v":0.18312231038538146},{"$f":"$H108*Multiplicateurs!F18","v":8.6628569360431867E-2},0.49051705817842572,{"$f":"($H108-(($H86+$H88)*$G39/10^6))*Multiplicateurs!G18","v":1.7551332132605704E-2},{"$f":"$H108*Multiplicateurs!H18","v":1.2300718881017497E-2},{"$f":"$H108*Multiplicateurs!I18","v":4.3397042179262133E-3},3.4191755231549416E-2,{"$f":"$H108*Multiplicateurs!J18","v":8.0933436705635367E-2},{"$f":"$H108*Multiplicateurs!K18","v":3.712711170990439E-2},{"$f":"$H108*Multiplicateurs!L18","v":1.6993935348172624E-2},0.13505448376371237,{"$f":"$H108*Multiplicateurs!M18","v":4.6252919042786743E-2},{"$f":"$H108*Multiplicateurs!N18","v":2.0262709695925245E-2},{"$f":"$H108*Multiplicateurs!O18","v":1.0569653366036528E-2},7.708528210474852E-2]
[null,null,"Services divers",{"$f":"MMULT(TRANSPOSE(DemandOM),MarginsOTH)","v":17179.413155179191},{"$f":"H$90*Multiplicateurs!D36*E$94","v":135123.47460773386},{"$f":"H$87*Multiplicateurs!D36*F$94","v":0},152302.88776291304,0.14452098838816566,null,null,null,{"$f":"$H109*Multiplicateurs!D19","v":0.98177763022051134},{"$f":"$H109*Multiplicateurs!E19","v":0.21199311842835017},{"$f":"$H109*Multiplicateurs!F19","v":0.18082065917933943},1.3745914078282011,{"$f":"$H109*Multiplicateurs!G19","v":4.9971336678746849E-2},{"$f":"$H109*Multiplicateurs!H19","v":1.2421777219628128E-2},{"$f":"$H109*Multiplicateurs!I19","v":9.0568080659664055E-3},7.1449921964341384E-2,{"$f":"$H109*Multiplicateurs!J19","v":0.14452098838816566},{"$f":"$H109*Multiplicateurs!K19","v":3.7954241079027375E-2},{"$f":"$H109*Multiplicateurs!L19","v":3.5467119283854508E-2},0.21794234875104754,{"$f":"$H109*Multiplicateurs!M19","v":0.10275927340701502},{"$f":"$H109*Multiplicateurs!N19","v":2.0963591414346474E-2},{"$f":"$H109*Multiplicateurs!O19","v":2.2030070773490923E-2},0.14575293559485242]
[null,null,"Services professionels",{"$f":"MMULT(TRANSPOSE(DemandOM),MarginsPRO)","v":0},{"$f":"H$90*Multiplicateurs!D37*E$94","v":1585.6593531530602},{"$f":"H$87*Multiplicateurs!D37*F$94","v":0},1585.6593531530602,1.5046402621160426E-3,null,null,null,{"$f":"$H110*Multiplicateurs!D20","v":7.471465874085142E-3},{"$f":"$H110*Multiplicateurs!E20","v":2.461598243908002E-3},{"$f":"$H110*Multiplicateurs!F20","v":2.3834982560855893E-3},1.2316562374078735E-2,{"$f":"$H110*Multiplicateurs!G20","v":6.4732818438596187E-4},{"$f":"$H110*Multiplicateurs!H20","v":1.5139226407330695E-4},{"$f":"$H110*Multiplicateurs!I20","v":1.1894929282828872E-4},9.1766974128755746E-4,{"$f":"$H110*Multiplicateurs!J20","v":1.5046402621160426E-3},{"$f":"$H110*Multiplicateurs!K20","v":4.7568063730718698E-4},{"$f":"$H110*Multiplicateurs!L20","v":4.6747396760460634E-4},2.4477948670278359E-3,{"$f":"$H110*Multiplicateurs!M20","v":9.6922721568752732E-4},{"$f":"$H110*Multiplicateurs!N20","v":2.7359202139159338E-4},{"$f":"$H110*Multiplicateurs!O20","v":2.9094892360736211E-4},1.5337681606864828E-3]
[null,null,"Gouvernement",{"$f":"MMULT(TRANSPOSE(DemandOM),MarginsGOV)","v":717325.25901651254},{"$f":"H$90*Multiplicateurs!D38*E$94","v":5636.64535406306},{"$f":"H$87*Multiplicateurs!D38*F$94","v":0},722961.90437057556,0.68602224502317388,null,null,null,{"$f":"$H111*Multiplicateurs!D21","v":2.4791146078475399},{"$f":"$H111*Multiplicateurs!E21","v":1.9533980469240051},{"$f":"$H111*Multiplicateurs!F21","v":1.0129288152459679},5.4454414700175127,{"$f":"$H111*Multiplicateurs!G21","v":0.23353898888501903},{"$f":"$H111*Multiplicateurs!H21","v":0.12656804944903272},{"$f":"$H111*Multiplicateurs!I21","v":5.0352092111411062E-2},0.41045913044546284,{"$f":"$H111*Multiplicateurs!J21","v":0.68602224502317388},{"$f":"$H111*Multiplicateurs!K21","v":0.34903859134727161},{"$f":"$H111*Multiplicateurs!L21","v":0.19865535905219586},1.2337161954226412,{"$f":"$H111*Multiplicateurs!M21","v":0.35408496665284284},{"$f":"$H111*Multiplicateurs!N21","v":0.21803230159342482},{"$f":"$H111*Multiplicateurs!O21","v":0.12336516569823019},0.69548243394449782]
[null,null,"Total",{"$f":"SUM(D98:D111)","v":1058598.1820633523},{"$f":"SUM(E98:E111)","v":330000},{"$f":"SUM(F98:F111)","v":0},{"$f":"SUM(G98:G111)","v":1388598.1820633523},{"$f":"SUM(H98:H111)","v":1.3176479099871226},null,null,"Total",{"$f":"SUM(L98:L111)","v":6.8252932307077074},{"$f":"SUM(M98:M111)","v":3.0865447664566394},1.8326901810995919,11.744528178263941,0.4349808054261613,0.20059416260742502,9.1327584208223178E-2,0.72690255224180955,1.3176479099871226,0.62206417708084549,0.35949794232565557,2.2992100293936231,0.72727031733429925,0.36109900902877362,0.22329650784430763,1.3116658342073806]
[]
[null,null,"Employés de centrale",null,"Revenus - Bruts ",null,{"$f":"K69","v":560988.81671382044},{"$f":"G114*G32/10^6","v":0}]
[null,null,"Employés de centrale",null,"Employés - (Ass, etc.)",{"$f":"DonnéesParDéfaut!N106","v":0.27},{"$f":"F115*G$114","v":151466.98051273153},0,null,null,null,null,null,null,null,"Convertir en dollars de ",{"$f":"D39","v":2020}]
[null,null,"Techniciens",{"$f":"IF(DonnéesProjet!$B$20=\"O\",DonnéesParDéfaut!I115,DonnéesParDéfaut!J115)","v":4},"Autres avantages",{"$f":"DonnéesParDéfaut!N107","v":6.83E-2},{"$f":"F116*G$114","v":38315.536181553936},{"$f":"IF(DonnéesProjet!B9=\"MyCounty\",0,IF(DonnéesProjet!B9=\"MARÉGION\",0,1))","v":1},null,"Sans les employés de centrale",null,{"$f":"L112","v":6.8252932307077074},{"$f":"M112","v":3.0865447664566394},{"$f":"N112","v":1.8326901810995919},{"$f":"O112","v":11.744528178263941},{"$f":"P112*$G60","v":0.45840284879526233},{"$f":"Q112*$G60","v":0.21139538674782482},9.6245223357896731E-2,{"$f":"P116+Q116+R116","v":0.76604345890098391},1.3885981820633522,0.65555994046212185,0.37885552383549859,2.4230136463609719,0.76643102672922303,0.38054280182263067,0.23532016595900113,1.382293994510855]
[null,null,"Administration / Secrétariat",{"$f":"IF(DonnéesProjet!$B$20=\"O\",DonnéesParDéfaut!I116,DonnéesParDéfaut!J116)","v":1},"Revenus (moins les taxes, avantages, etc)",null,{"$f":"G114-G115-G116","v":371206.300019535},null,null,"Avec les employés de centrale",null,{"$f":"L116+L137","v":12.825293230707707},{"$f":"M116+M137","v":3.8034598672684803},{"$f":"N116+N137","v":2.2846882857498851},{"$f":"O116+O137","v":18.913441383726074},{"$f":"(P112+P137)*$G60","v":0.86792468499635111},{"$f":"(Q112+Q137)*$G60","v":0.26013261666371823},0.12006962929745905,1.2481269309575285,1.7981200182644412,0.83517346607770948,0.47233224728258943,3.1056257316247398,1.175952862930312,0.47248602540000495,0.29339760830201722,1.9418364966323343]
[null,null,"Gestion de site",{"$f":"IF(DonnéesProjet!$B$20=\"O\",DonnéesParDéfaut!I117,DonnéesParDéfaut!J117)","v":1}]
[null,null,"  Total",{"$f":"SUM(D116:D118)","v":6}]
[null,null,null,null,null,null,null,null,null,null,null,"Employés de centrale seulement"]
[null,null,"Dépenses des employés de la centrale",null,null,"DPC",null,"Demande ajustée - Million",null,null,null,"Emplois",null,null,null,"Revenus d'emploi",null,null,null,"Extrant",null,null,null,"Valeur ajoutée"]
[null,null,null,null,null,"Employ. Centrale",null,{"$f":"H97","v":2017},"Dollars",null,null,"Direct","Indirect","Induit","Total","Direct","Indirect","Induit","Total","Direct","Indirect","Induit","Total","Direct","Indirect","Induit","Total"]
[null,null,"Agriculture",null,null,{"$f":"G$117*Multiplicateurs!D25","v":4761.3709297666819},null,{"$f":"F123*G$39/10^6","v":4.5180892034282381E-3},null,null,null,null,{"$f":"$H123*Multiplicateurs!E8","v":8.9234186277714657E-3},{"$f":"$H123*Multiplicateurs!F8","v":2.33105905328671E-3},{"$f":"M123+N123","v":1.1254477681058176E-2},null,{"$f":"$H123*Multiplicateurs!H8","v":5.3656816534181377E-4},{"$f":"$H123*Multiplicateurs!I8","v":1.1825487623512639E-4},{"$f":"Q123+R123","v":6.5482304157694015E-4},{"$f":"$H123*Multiplicateurs!J8","v":4.5180892034282381E-3},{"$f":"$H123*Multiplicateurs!K8","v":2.6544655772304977E-3},{"$f":"$H123*Multiplicateurs!L8","v":4.6105381386416216E-4},{"$f":"T123+U123+V123","v":7.633608594522898E-3},null,{"$f":"$H123*Multiplicateurs!N8","v":1.1731426177253525E-3},{"$f":"$H123*Multiplicateurs!O8","v":2.8518416759488216E-4},{"$f":"Y123+Z123","v":1.4583267853202346E-3}]
[null,null,"Exploitation minière",null,null,{"$f":"G$117*Multiplicateurs!D26","v":1186.1939485942419},null,{"$f":"F124*G$39/10^6","v":1.1255854986660689E-3},null,null,null,null,{"$f":"$H124*Multiplicateurs!E9","v":1.8695802744631146E-3},{"$f":"$H124*Multiplicateurs!F9","v":9.0636443348601553E-4},{"$f":"M124+N124","v":2.7759447079491301E-3},null,{"$f":"$H124*Multiplicateurs!H9","v":1.5445272945823404E-4},{"$f":"$H124*Multiplicateurs!I9","v":4.5291737585576333E-5},{"$f":"Q124+R124","v":1.9974446704381038E-4},{"$f":"$H124*Multiplicateurs!J9","v":1.1255854986660689E-3},{"$f":"$H124*Multiplicateurs!K9","v":4.6997513401667501E-4},{"$f":"$H124*Multiplicateurs!L9","v":1.7855005489842115E-4},{"$f":"T124+U124+V124","v":1.7741106875811649E-3},null,{"$f":"$H124*Multiplicateurs!N9","v":2.6297203181685432E-4},{"$f":"$H124*Multiplicateurs!O9","v":1.1046152828121264E-4},{"$f":"Y124+Z124","v":3.7343356009806694E-4}]
[null,null,"Construction",null,null,{"$f":"G$117*Multiplicateurs!D27","v":202.93842733073447},null,1.9256931060580642E-4,null,null,null,null,{"$f":"$H125*Multiplicateurs!E10","v":4.0034247510016302E-4},{"$f":"$H125*Multiplicateurs!F10","v":2.6118842353537038E-4},6.6153089863553341E-4,null,{"$f":"$H125*Multiplicateurs!H10","v":3.1012040078624488E-5},{"$f":"$H125*Multiplicateurs!I10","v":1.3013005859437654E-5},4.4025045938062144E-5,{"$f":"$H125*Multiplicateurs!J10","v":1.9256931060580642E-4},{"$f":"$H125*Multiplicateurs!K10","v":9.5779317665034935E-5},{"$f":"$H125*Multiplicateurs!L10","v":5.1278189954560395E-5},3.3962681822540176E-4,null,{"$f":"$H125*Multiplicateurs!N10","v":5.2204373213734342E-5},{"$f":"$H125*Multiplicateurs!O10","v":3.186343630308315E-5},8.4067809516817491E-5]
[null,null,"Secteur manufacturier",null,null,{"$f":"G$117*Multiplicateurs!D28","v":70641.045041295671},null,6.7031648579331651E-2,null,null,null,null,{"$f":"$H126*Multiplicateurs!E11","v":0.14831874940867737},{"$f":"$H126*Multiplicateurs!F11","v":4.9994052943005719E-2},0.19831280235168308,null,{"$f":"$H126*Multiplicateurs!H11","v":9.8893762571033612E-3},{"$f":"$H126*Multiplicateurs!I11","v":2.4891127779799061E-3},1.2378489035083267E-2,{"$f":"$H126*Multiplicateurs!J11","v":6.7031648579331651E-2},{"$f":"$H126*Multiplicateurs!K11","v":5.478610353278298E-2},{"$f":"$H126*Multiplicateurs!L11","v":9.8394970103778644E-3},0.13165724912249249,null,{"$f":"$H126*Multiplicateurs!N11","v":2.3923539305718874E-2},{"$f":"$H126*Multiplicateurs!O11","v":6.111227106797467E-3},3.0034766412516341E-2]
[null,null,"Fabrication de produits métalliques",null,null,{"$f":"G$117*Multiplicateurs!D29","v":85.328552027318992},null,8.0968699004025318E-5,null,null,null,null,{"$f":"$H127*Multiplicateurs!E12","v":1.2844044653930879E-4},{"$f":"$H127*Multiplicateurs!F12","v":9.2203398811252521E-5},2.2064384535056133E-4,null,{"$f":"$H127*Multiplicateurs!H12","v":9.7451661656379127E-6},{"$f":"$H127*Multiplicateurs!I12","v":4.617666274918615E-6},1.4362832440556528E-5,{"$f":"$H127*Multiplicateurs!J12","v":8.0968699004025318E-5},{"$f":"$H127*Multiplicateurs!K12","v":3.2111889096704677E-5},{"$f":"$H127*Multiplicateurs!L12","v":1.8112311309600479E-5},1.3119289941033047E-4,null,{"$f":"$H127*Multiplicateurs!N12","v":1.6036703266175354E-5},{"$f":"$H127*Multiplicateurs!O12","v":1.1243535743753509E-5},2.7280239009928863E-5]
[null,null,"Machinerie",null,null,{"$f":"G$117*Multiplicateurs!D30","v":1075.2036466208203},null,1.0202662340197564E-3,null,null,null,null,{"$f":"$H128*Multiplicateurs!E13","v":1.5673836634243498E-3},{"$f":"$H128*Multiplicateurs!F13","v":1.1378972608071544E-3},2.7052809242315043E-3,null,{"$f":"$H128*Multiplicateurs!H13","v":1.2130015409907426E-4},{"$f":"$H128*Multiplicateurs!I13","v":5.7046438760297316E-5},1.7834659285937158E-4,{"$f":"$H128*Multiplicateurs!J13","v":1.0202662340197564E-3},{"$f":"$H128*Multiplicateurs!K13","v":3.8598096418027052E-4},{"$f":"$H128*Multiplicateurs!L13","v":2.2362265420939961E-4},1.6298698524094266E-3,null,{"$f":"$H128*Multiplicateurs!N13","v":1.995374924473887E-4},{"$f":"$H128*Multiplicateurs!O13","v":1.3865783957436032E-4},3.3819533202174903E-4]
[null,null,"Équipements électriques",null,null,{"$f":"G$117*Multiplicateurs!D31","v":1552.7973960909262},null,1.4734573831519738E-3,null,null,null,null,{"$f":"$H129*Multiplicateurs!E14","v":1.4321327113423384E-3},{"$f":"$H129*Multiplicateurs!F14","v":1.2585144623982179E-3},2.6906471737405562E-3,null,{"$f":"$H129*Multiplicateurs!H14","v":1.0113819456904034E-4},{"$f":"$H129*Multiplicateurs!I14","v":6.240152920386465E-5},1.6353972377290498E-4,{"$f":"$H129*Multiplicateurs!J14","v":1.4734573831519738E-3},{"$f":"$H129*Multiplicateurs!K14","v":3.2107366714680401E-4},{"$f":"$H129*Multiplicateurs!L14","v":2.4694025820289355E-4},2.0414713085016713E-3,null,{"$f":"$H129*Multiplicateurs!N14","v":1.7299349137494746E-4},{"$f":"$H129*Multiplicateurs!O14","v":1.5367177621415548E-4},3.2666526758910297E-4]
[null,null,"TCSP",null,null,{"$f":"G$117*Multiplicateurs!D32","v":17298.163021026434},null,1.6414315275426541E-2,null,null,null,null,{"$f":"$H130*Multiplicateurs!E15","v":2.6870989657079517E-2},{"$f":"$H130*Multiplicateurs!F15","v":1.8727867897644294E-2},4.5598857554723815E-2,null,{"$f":"$H130*Multiplicateurs!H15","v":1.9591331451021426E-3},{"$f":"$H130*Multiplicateurs!I15","v":9.3469549133074793E-4},2.8938286364328905E-3,{"$f":"$H130*Multiplicateurs!J15","v":1.6414315275426541E-2},{"$f":"$H130*Multiplicateurs!K15","v":7.4633558581352309E-3},{"$f":"$H130*Multiplicateurs!L15","v":3.6771755133626041E-3},2.7554846646924376E-2,null,{"$f":"$H130*Multiplicateurs!N15","v":3.6258712888829472E-3},{"$f":"$H130*Multiplicateurs!O15","v":2.2805026636222975E-3},5.9063739525052443E-3]
[null,null,"Commerce de gros",null,null,{"$f":"G$117*Multiplicateurs!D33","v":14665.408604918779},null,1.3916081157952126E-2,null,null,null,null,{"$f":"$H131*Multiplicateurs!E16","v":2.1330940934587091E-2},{"$f":"$H131*Multiplicateurs!F16","v":2.0880933361391421E-2},4.2211874295978516E-2,null,{"$f":"$H131*Multiplicateurs!H16","v":1.4545542964940266E-3},{"$f":"$H131*Multiplicateurs!I16","v":1.0436983153727826E-3},2.4982526118668092E-3,{"$f":"$H131*Multiplicateurs!J16","v":1.3916081157952126E-2},{"$f":"$H131*Multiplicateurs!K16","v":4.8870191814217425E-3},{"$f":"$H131*Multiplicateurs!L16","v":4.0958479102280003E-3},2.2898948249601869E-2,null,{"$f":"$H131*Multiplicateurs!N16","v":2.690183604352984E-3},{"$f":"$H131*Multiplicateurs!O16","v":2.5445356893167093E-3},5.2347192936696933E-3]
[null,null,"Commerce de détail",null,null,{"$f":"G$117*Multiplicateurs!D34","v":46776.082826050741},null,4.4386063995522598E-2,null,null,null,null,{"$f":"$H132*Multiplicateurs!E17","v":7.8890376354652444E-2},{"$f":"$H132*Multiplicateurs!F17","v":7.1800753250085031E-2},0.15069112960473746,null,{"$f":"$H132*Multiplicateurs!H17","v":5.1659827800796809E-3},{"$f":"$H132*Multiplicateurs!I17","v":3.5868522305366108E-3},8.7528350106162913E-3,{"$f":"$H132*Multiplicateurs!J17","v":4.4386063995522598E-2},{"$f":"$H132*Multiplicateurs!K17","v":1.8185901447190313E-2},{"$f":"$H132*Multiplicateurs!L17","v":1.4082060771997329E-2},7.665402621471025E-2,null,{"$f":"$H132*Multiplicateurs!N17","v":1.0331391240432884E-2},{"$f":"$H132*Multiplicateurs!O17","v":8.7511799135253972E-3},1.9082571153958283E-2]
[null,null,"FAI",null,null,{"$f":"G$117*Multiplicateurs!D35+(G116*H116)","v":91157.152101609463},null,8.6499487395687802E-2,null,null,null,null,{"$f":"$H133*Multiplicateurs!E18","v":0.19571621598946137},{"$f":"$H133*Multiplicateurs!F18","v":9.2586292495563646E-2},0.28830250848502503,null,{"$f":"$H133*Multiplicateurs!H18","v":1.3146678568419E-2},{"$f":"$H133*Multiplicateurs!I18","v":4.6381595244105577E-3},1.7784838092829557E-2,{"$f":"$H133*Multiplicateurs!J18","v":8.6499487395687802E-2},{"$f":"$H133*Multiplicateurs!K18","v":3.9680461649857925E-2},{"$f":"$H133*Multiplicateurs!L18","v":1.8162662507448395E-2},0.1443426115529941,null,{"$f":"$H133*Multiplicateurs!N18","v":2.1656240897319091E-2},{"$f":"$H133*Multiplicateurs!O18","v":1.1296562154373527E-2},3.2952803051692618E-2]
[null,null,"Services divers",null,null,{"$f":"G$117*Multiplicateurs!D36","v":151996.01531794085},null,0.14422979555717014,null,null,null,null,{"$f":"$H134*Multiplicateurs!E19","v":0.21156597717367706},{"$f":"$H134*Multiplicateurs!F19","v":0.18045632677173448},0.39202230394541154,null,{"$f":"$H134*Multiplicateurs!H19","v":1.2396748796317986E-2},{"$f":"$H134*Multiplicateurs!I19","v":9.0385596605968791E-3},2.1435308456914867E-2,{"$f":"$H134*Multiplicateurs!J19","v":0.14422979555717014},{"$f":"$H134*Multiplicateurs!K19","v":3.7877767737463978E-2},{"$f":"$H134*Multiplicateurs!L19","v":3.5395657200826249E-2},0.21750322049546036,null,{"$f":"$H134*Multiplicateurs!N19","v":2.0921352237879033E-2},{"$f":"$H134*Multiplicateurs!O19","v":2.198568276627404E-2},4.2907035004153077E-2]
[null,null,"Services professionels",null,null,{"$f":"G$117*Multiplicateurs!D37","v":1783.6567926524747},null,1.6925210441227862E-3,null,null,null,null,{"$f":"$H135*Multiplicateurs!E20","v":2.7689720492596183E-3},{"$f":"$H135*Multiplicateurs!F20","v":2.681119905286502E-3},5.4500919545461199E-3,null,{"$f":"$H135*Multiplicateurs!H20","v":1.7029624908555344E-4},{"$f":"$H135*Multiplicateurs!I20","v":1.3380220266887653E-4},3.0409845175442997E-4,{"$f":"$H135*Multiplicateurs!J20","v":1.6925210441227862E-3},{"$f":"$H135*Multiplicateurs!K20","v":5.3507772535071288E-4},{"$f":"$H135*Multiplicateurs!L20","v":5.2584630869684202E-4},2.7534450781703411E-3,null,{"$f":"$H135*Multiplicateurs!N20","v":3.0775479386557222E-4},{"$f":"$H135*Multiplicateurs!O20","v":3.2727901038471277E-4},6.3503380425028498E-4]
[null,null,"Gouvernement",null,null,{"$f":"G$117*Multiplicateurs!D38","v":6340.4795951637889},null,6.016513484461989E-3,null,null,null,null,{"$f":"$H136*Multiplicateurs!E21","v":1.7131581045805571E-2},{"$f":"$H136*Multiplicateurs!F21","v":8.8835309932575254E-3},2.6015112039063096E-2,null,{"$f":"$H136*Multiplicateurs!H21","v":1.1100199472196906E-3},{"$f":"$H136*Multiplicateurs!I21","v":4.4159506977640837E-4},1.5516150169960989E-3,{"$f":"$H136*Multiplicateurs!J21","v":6.016513484461989E-3},{"$f":"$H136*Multiplicateurs!K21","v":3.0611185084348674E-3},{"$f":"$H136*Multiplicateurs!L21","v":1.7422359918632085E-3},1.0819867984760064E-2,null,{"$f":"$H136*Multiplicateurs!N21","v":1.9121745571687855E-3},{"$f":"$H136*Multiplicateurs!O21","v":1.0819301973381593E-3},2.9941047545069448E-3]
[null,null,"Total",null,null,{"$f":"SUM(F123:F136)","v":409521.83620108891},null,{"$f":"SUM(H123:H136)","v":0.38859736281855145},null,null,null,{"$f":"IF(L139=0,0,D119)","v":6},{"$f":"SUM(M123:M136)","v":0.71691510081184084},{"$f":"SUM(N123:N136)","v":0.45199810465029339},{"$f":"L137+M137+N137","v":7.1689132054621343},{"$f":"H137","v":0.38859736281855145},{"$f":"SUM(Q123:Q136)","v":4.6247006489533865E-2},{"$f":"SUM(R123:R136)","v":2.260710052659199E-2},{"$f":"R137+Q137+P137","v":0.45745146983467733},{"$f":"SUM(T123:T136)","v":0.38859736281855145},{"$f":"SUM(U123:U136)","v":0.17043619218997377},{"$f":"SUM(V123:V136)","v":8.8700540497239522E-2},{"$f":"T137+U137+V137","v":0.64773409550576477},{"$f":"P137","v":0.38859736281855145},{"$f":"SUM(Y123:Y136)","v":8.7245394635464643E-2},{"$f":"SUM(Z123:Z136)","v":5.5109981785343751E-2},{"$f":"X137+Y137+Z137","v":0.53095273923935982}]
[null,null,null,null,null,null,null,null,null,null,null,null,null,null,null,"Convertir en dollars de ",{"$f":"Q115","v":2020}]
[null,null,null,"Demande locale - Coûts annuel d'O&M","Demande locale - Coûts de cosntruction",null,null,null,null,null,null,{"$f":"SUM(M144:M157)","v":3.8034598672684803},null,null,null,{"$f":"P137*$G60","v":0.40952183620108884},4.8737229915893382E-2,2.3824405939562331E-2,0.48208347205654456,0.40952183620108884,0.17961352561558774,9.347672344709089E-2,0.68261208526376749,0.40952183620108884,9.1943223577374278E-2,5.8077442343016109E-2,0.55954250212147916]
[]
[null,null,"Agriculture",0,0,null,null,null,null,null,null,"Avec employés de centrale"]
[null,null,"Exploitation minière",0,0,null,null,null,null,null,null,"Emplois",null,null,null,"Revenus d'emploi",null,null,null,"Extrant",null,null,null,"Valeur ajoutée"]
[null,null,"Construction",0,{"$f":"+G7+G13+G14+G15+G16+G10+H29","v":27250442.852441963},null,null,null,null,null,null,"Direct","Indirect","Induit","Total","Direct","Indirect","Induit","Total","Direct","Indirect","Induit","Total","Direct","Indirect","Induit","Total"]
[null,null,"Secteur manufacturier",{"$f":"0.75*G81","v":18458.134596501561},{"$f":"G9+G22+(I28)","v":3948569.8676111726},null,null,null,null,"Agriculture",null,{"$f":"L98+L123","v":9.2141823033410186E-3},1.6856280077077727E-2,4.4033554759070484E-3,{"$f":"L144+M144+N144","v":3.0473817856325795E-2},{"$f":"P98+P123","v":2.9352615499896213E-4},1.0135737941619073E-3,2.2338269641365797E-4,{"$f":"P144+Q144+R144","v":1.5304826455745273E-3},{"$f":"T98+T123","v":8.5346412852567409E-3},5.0142683080569017E-3,8.7092767259761212E-4,{"$f":"T144+U144+V144","v":1.4419837265911254E-2},{"$f":"X98+X123","v":1.8560928223978485E-3},2.2160588177709689E-3,5.3871104820374708E-4,{"$f":"X144+Y144+Z144","v":4.610862688372565E-3}]
[null,null,"Fabrication de produits métalliques",0,{"$f":"G23","v":0},null,null,null,null,"Exploitation minière",null,7.1439982096237415E-4,3.5316250472494596E-3,1.7121165530880932E-3,{"$f":"L145+M145+N145","v":5.9581414212999265E-3},1.3333204400097135E-4,2.9176020704828288E-4,8.5555799382085797E-5,{"$f":"P145+Q145+R145","v":5.1064805043134003E-4},2.126223727436042E-3,8.8777998866849776E-4,3.3727989895919865E-4,{"$f":"T145+U145+V145","v":3.3512836150637383E-3},5.4200045699354571E-4,4.9675246737248744E-4,2.0866111253094611E-4,{"$f":"X145+Y145+Z145","v":1.2474140368969793E-3}]
[null,null,"Machinerie",0,{"$f":"G21","v":0},null,null,null,null,"Construction",null,5.9687778830784066E-4,7.5624434631328978E-4,4.9338324286396561E-4,1.8465053774850962E-3,5.042829748494675E-5,5.8581543143113188E-5,2.4581483908943915E-5,1.3359132453700387E-4,3.6376218232315571E-4,1.8092651163183502E-4,9.6864169190673596E-5,6.415528631456643E-4,7.0229941327996123E-5,9.8613723377311122E-5,6.0189825104846713E-5,2.2903348981015396E-4]
[null,null,"Équipements électriques",{"$f":"0.25*G81","v":6152.7115321671872},{"$f":"G8","v":0},null,null,null,null,"Secteur manufacturier",null,0.10623017462394146,0.31418471729883179,0.1059027766424932,0.52631766856526641,8.6530135497540073E-3,2.0948739764778644E-2,5.272706232977268E-3,3.4874459547509923E-2,0.14199364303526024,0.11605381328373651,2.0843080183006228E-2,0.27889053650200296,2.4150672123349655E-2,5.067741242102887E-2,1.2945458133601193E-2,8.7773542677979724E-2]
[null,null,"TCSP",{"$f":"G77","v":43206.076930816176},{"$f":"G24","v":0},null,null,null,null,"Fabrication de produits métalliques",null,2.1602877850077377E-4,2.4262317284471188E-4,1.741716240437232E-4,6.3282357538920885E-4,1.8743656768365451E-5,1.8408555861586697E-5,8.7227417293032814E-6,4.5874954359255429E-5,1.5294934876649489E-4,6.0659150825169075E-5,3.4214038925359187E-5,2.4782253851702316E-4,2.5814758497844303E-5,3.0293228754992128E-5,2.123896630418149E-5,7.7346953557017921E-5]
[null,null,"Commerce de gros",0,0,null,null,null,null,"Machinerie",null,2.5330599725376692E-3,2.9607776034054748E-3,2.1494805664962003E-3,7.6433181424393438E-3,2.2555003656455803E-4,2.29135206603808E-4,1.0776035387948419E-4,5.6244559704785014E-4,1.9272763176546547E-3,7.2911554506638733E-4,4.2242174755781077E-4,3.0788136102788527E-3,3.5669204552792906E-4,3.7692503275630316E-4,2.6192376220856911E-4,9.9554084049280128E-4]
[null,null,"Commerce de détail",{"$f":"G74+G79+G80","v":217415.19481211988},{"$f":"G17*0.5","v":1924012.4309552263},null,null,null,null,"Équipements électriques",null,1.6983502830460972E-2,7.7522016200113168E-3,6.8123978852955552E-3,3.1548102335767846E-2,1.3978551521069834E-3,5.4746579669159986E-4,3.3778240798086709E-4,2.2831033567794505E-3,7.9758940091397106E-3,1.7379868380113055E-3,1.3366992140638849E-3,1.10505800612149E-2,2.529536426679713E-3,9.3642189265496665E-4,8.3183254113425829E-4,4.2977908604689384E-3]
[null,null,"FAI",{"$f":"J90+G78+H86+H88+(D66*E66*DonnéesParDéfaut!N107)+(D67*E67*DonnéesParDéfaut!N107)+(D68*E68*DonnéesParDéfaut!N107)","v":38315.536181553936},{"$f":"G32","v":0},null,null,null,null,"TCSP",null,0.17256009389044874,0.11901341719901096,8.2946984230745674E-2,0.37452049532020537,1.5365297606308056E-2,8.6771322278047132E-3,4.1398290827175718E-3,2.8182258916830343E-2,7.2700104344528893E-2,3.3055704154718854E-2,1.6286457219133747E-2,0.12204226571838149,3.3959921087243626E-2,1.6059227364558573E-2,1.0100499400759124E-2,6.0119647852561325E-2]
[null,null,"Services divers",{"$f":"G75","v":17282.430772326472},{"$f":"G17*0.5","v":1924012.4309552263},null,null,null,null,"Commerce de gros",null,7.0320705389754018E-2,4.4298345008977433E-2,4.3363806265693423E-2,0.15798285666442488,5.8428133589516354E-3,3.0206988176459514E-3,2.1674668830340103E-3,1.1030979059631598E-2,2.8899773629223E-2,1.0148959787005356E-2,8.5059203149066964E-3,4.7554653731135058E-2,9.4523877183684494E-3,5.5867522116613911E-3,5.2842825920651178E-3,2.0323422522094958E-2]
[null,null,"Services professionels",0,{"$f":"G30+G31+J29","v":1116168.648146664},null,null,null,null,"Commerce de détail",null,2.7567943229347049,0.51570581565490992,0.46936100105559142,3.7418611396452062,0.10129125968846528,3.3769991808425423E-2,2.3447226907207287E-2,0.15850847840409799,0.29015137706555133,0.11888110530848041,9.2054328703891616E-2,0.5010868110779233,0.15026058363558054,6.7536229292981753E-2,5.7206399358003958E-2,0.27500321228656627]
[null,null,"Gouvernement",{"$f":"G76+G83+G84+G89+(D66*E66*DonnéesParDéfaut!N106)+(D67*E67*DonnéesParDéfaut!N106)+(D68*E68*DonnéesParDéfaut!N106)","v":717768.49974543555},{"$f":"G33+G36","v":519977.89105910808},null,null,null,null,"FAI",null,0.22076617843261243,0.37883852637484283,0.1792148618559955,0.77881956666345076,1.7551332132605704E-2,2.5447397449436499E-2,8.977863742336771E-3,5.1976593324378977E-2,0.16743292410132316,7.6807573359762321E-2,3.5156597855621016E-2,0.27939709531670648,4.6252919042786743E-2,4.1918950593244339E-2,2.1866215520410057E-2,0.11003808515644113]
[null,null,"Total",{"$f":"SUM(D141:D154)","v":1058598.5845709208},{"$f":"SUM(E141:E154)","v":36683184.121169366},null,null,null,null,"Services divers",null,0.98177763022051134,0.4235590956020272,0.36127698595107394,1.7666137117736125,4.9971336678746849E-2,2.4818526015946113E-2,1.8095367726563283E-2,9.2885230421256237E-2,0.28875078394533582,7.5832008816491353E-2,7.0862776484680756E-2,0.4354455692465079,0.10275927340701502,4.1884943652225504E-2,4.401575353976496E-2,0.18865997059900547]
[null,null,null,null,null,null,null,null,null,"Services professionels",null,7.471465874085142E-3,5.2305702931676207E-3,5.0646181613720909E-3,1.7766654328624856E-2,6.4732818438596187E-4,3.2168851315886039E-4,2.5275149549716528E-4,1.2217681930419876E-3,3.197161306238829E-3,1.0107583626578999E-3,9.9332027630144831E-4,5.2012399451981774E-3,9.6922721568752732E-4,5.8134681525716554E-4,6.1822793399207493E-4,2.1688019649367678E-3]
[null,null,null,null,null,null,null,null,null,"Gouvernement",null,2.4791146078475399,1.9705296279698106,1.0218123462392255,5.4714565820565761,0.23353898888501903,0.1276780693962524,5.0793687181187472E-2,0.41201074546245892,0.69203875850763585,0.35209970985570649,0.20039759504405907,1.2445360634074014,0.35408496665284284,0.21994447615059359,0.12444709589556835,0.69847653869900483]
[null,null,null,null,null,null,null,null,null,"Employés de centrale",null,{"$f":"L137","v":6},null,null,6,{"$f":"P137","v":0.38859736281855145},null,null,0.38859736281855145,null,null,null,0,{"$f":"X137","v":0.38859736281855145},null,null,0.38859736281855145]
[null,null,null,null,null,null,null,null,null,"Total",null,{"$f":"SUM(L144:L158)","v":12.825293230707707},{"$f":"SUM(M144:M157)","v":3.8034598672684803},{"$f":"SUM(N144:N157)","v":2.2846882857498851},{"$f":"SUM(O144:O158)","v":18.913441383726074},0.82357816824471275,0.24684116909695891,0.11393468473481518,1.1843540220764868,1.7062452728056741,0.79250036927081924,0.44819848282289515,2.946944124899388,1.1158676801528506,0.44834440366423822,0.27840648962965137,1.8426185734467402]
[null,null,null,null,null,null,null,null,null,"Convertir en dollars de ",{"$f":"Q138","v":2020},null,null,null,null,{"$f":"P159*$G60","v":0.86792468499635111},0.26013261666371823,0.12006962929745907,1.2481269309575285,1.7981200182644412,0.83517346607770948,0.47233224728258955,3.1056257316247398,1.175952862930312,0.47248602540000489,0.29339760830201722,1.941836496632334]
[]
[]
[null,null,"À partir des données par défaut",null,null,null,null,"À partir des données par défaut",null,null,null,null,"À partir des données par défaut"]
[null,null,"Dette - Calendrier de remboursement du prêt",null,null,null,null,"Capitaux propres - Calendrier de remboursement des investissements (particuliers)",null,null,null,null,"Capitaux propres - Calendrier de remboursement des investissements (entreprises)"]
[null,null,"Année"," Pmt intérêt","Pmt principal ","Pmt total",null,"Année"," Pmt intérêt","Pmt principal ","Pmt total",null,"Année"," Pmt intérêt","Pmt principal ","Pmt total"]
[null,null,1,{"$f":"IF(C166<=DonnéesParDéfaut!D$85,-IPMT(DonnéesParDéfaut!D$86,C166,DonnéesParDéfaut!D$85,DonnéesParDéfaut!D$48*DonnéesParDéfaut!D$84),0)","v":10532706.375075337},{"$f":"IF(C166<=DonnéesParDéfaut!D$85,-PPMT(DonnéesParDéfaut!D$86,C166,DonnéesParDéfaut!D$85,DonnéesParDéfaut!D$84*DonnéesParDéfaut!D$48),0)","v":4173608.4552211505},{"$f":"D166+E166","v":14706314.830296487},null,1,{"$f":"IF(H166<=DonnéesParDéfaut!$D$93,-IPMT(DonnéesParDéfaut!$D$92,H166,DonnéesParDéfaut!$D$93,DonnéesParDéfaut!$D$48*DonnéesParDéfaut!$D$89*DonnéesParDéfaut!$D$90),0)","v":0},{"$f":"IF(H166<=DonnéesParDéfaut!$D$93,-PPMT(DonnéesParDéfaut!$D$92,H166,DonnéesParDéfaut!$D$93,DonnéesParDéfaut!$D$89*DonnéesParDéfaut!$D$48*DonnéesParDéfaut!$D$90),0)","v":0},{"$f":"I166+J166","v":0},null,1,{"$f":"IF(M166<=DonnéesParDéfaut!$D$93,-IPMT(DonnéesParDéfaut!$D$92,M166,DonnéesParDéfaut!$D$93,DonnéesParDéfaut!$D$48*DonnéesParDéfaut!$D$89*DonnéesParDéfaut!$D$91),0)","v":4051040.9134905133},{"$f":"IF(M166<=DonnéesParDéfaut!$D$93,-PPMT(DonnéesParDéfaut!$D$92,M166,DonnéesParDéfaut!$D$93,DonnéesParDéfaut!$D$89*DonnéesParDéfaut!$D$48*DonnéesParDéfaut!$D$91),0)","v":707296.54287775478},{"$f":"N166+O166","v":4758337.4563682685}]
[null,null,2,{"$f":"IF(C167<=DonnéesParDéfaut!D$85,-IPMT(DonnéesParDéfaut!D$86,C167,DonnéesParDéfaut!D$85,DonnéesParDéfaut!D$48*DonnéesParDéfaut!D$84),0)","v":10261421.82548596},{"$f":"IF(C167<=DonnéesParDéfaut!D$85,-PPMT(DonnéesParDéfaut!D$86,C167,DonnéesParDéfaut!D$85,DonnéesParDéfaut!D$84*DonnéesParDéfaut!D$48),0)","v":4444893.0048105251},{"$f":"D167+E167","v":14706314.830296485},null,2,{"$f":"IF(H167<=DonnéesParDéfaut!$D$93,-IPMT(DonnéesParDéfaut!$D$92,H167,DonnéesParDéfaut!$D$93,DonnéesParDéfaut!$D$48*DonnéesParDéfaut!$D$89*DonnéesParDéfaut!$D$90),0)","v":0},{"$f":"IF(H167<=DonnéesParDéfaut!$D$93,-PPMT(DonnéesParDéfaut!$D$92,H167,DonnéesParDéfaut!$D$93,DonnéesParDéfaut!$D$89*DonnéesParDéfaut!$D$48*DonnéesParDéfaut!$D$90),0)","v":0},{"$f":"I167+J167","v":0},null,2,{"$f":"IF(M167<=DonnéesParDéfaut!$D$93,-IPMT(DonnéesParDéfaut!$D$92,M167,DonnéesParDéfaut!$D$93,DonnéesParDéfaut!$D$48*DonnéesParDéfaut!$D$89*DonnéesParDéfaut!$D$91),0)","v":3980311.2592027374},{"$f":"IF(M167<=DonnéesParDéfaut!$D$93,-PPMT(DonnéesParDéfaut!$D$92,M167,DonnéesParDéfaut!$D$93,DonnéesParDéfaut!$D$89*DonnéesParDéfaut!$D$46*DonnéesParDéfaut!$D$91),0)","v":778026.19716553052},{"$f":"N167+O167","v":4758337.4563682675}]
[null,null,3,{"$f":"IF(C168<=DonnéesParDéfaut!D$85,-IPMT(DonnéesParDéfaut!D$86,C168,DonnéesParDéfaut!D$85,DonnéesParDéfaut!D$48*DonnéesParDéfaut!D$84),0)","v":9972503.7801732756},{"$f":"IF(C168<=DonnéesParDéfaut!D$85,-PPMT(DonnéesParDéfaut!D$86,C168,DonnéesParDéfaut!D$85,DonnéesParDéfaut!D$84*DonnéesParDéfaut!D$48),0)","v":4733811.0501232091},14706314.830296485,null,3,{"$f":"IF(H168<=DonnéesParDéfaut!$D$93,-IPMT(DonnéesParDéfaut!$D$92,H168,DonnéesParDéfaut!$D$93,DonnéesParDéfaut!$D$48*DonnéesParDéfaut!$D$89*DonnéesParDéfaut!$D$90),0)","v":0},{"$f":"IF(H168<=DonnéesParDéfaut!$D$93,-PPMT(DonnéesParDéfaut!$D$92,H168,DonnéesParDéfaut!$D$93,DonnéesParDéfaut!$D$89*DonnéesParDéfaut!$D$48*DonnéesParDéfaut!$D$90),0)","v":0},0,null,3,{"$f":"IF(M168<=DonnéesParDéfaut!$D$93,-IPMT(DonnéesParDéfaut!$D$92,M168,DonnéesParDéfaut!$D$93,DonnéesParDéfaut!$D$48*DonnéesParDéfaut!$D$89*DonnéesParDéfaut!$D$91),0)","v":3902508.6394861843},{"$f":"IF(M168<=DonnéesParDéfaut!$D$93,-PPMT(DonnéesParDéfaut!$D$92,M168,DonnéesParDéfaut!$D$93,DonnéesParDéfaut!$D$89*DonnéesParDéfaut!$D$46*DonnéesParDéfaut!$D$91),0)","v":855828.81688208343},4758337.4563682675]
[null,null,4,{"$f":"IF(C169<=DonnéesParDéfaut!D$85,-IPMT(DonnéesParDéfaut!D$86,C169,DonnéesParDéfaut!D$85,DonnéesParDéfaut!D$48*DonnéesParDéfaut!D$84),0)","v":9664806.0619152673},{"$f":"IF(C169<=DonnéesParDéfaut!D$85,-PPMT(DonnéesParDéfaut!D$86,C169,DonnéesParDéfaut!D$85,DonnéesParDéfaut!D$84*DonnéesParDéfaut!D$48),0)","v":5041508.7683812175},14706314.830296485,null,4,{"$f":"IF(H169<=DonnéesParDéfaut!$D$93,-IPMT(DonnéesParDéfaut!$D$92,H169,DonnéesParDéfaut!$D$93,DonnéesParDéfaut!$D$48*DonnéesParDéfaut!$D$89*DonnéesParDéfaut!$D$90),0)","v":0},{"$f":"IF(H169<=DonnéesParDéfaut!$D$93,-PPMT(DonnéesParDéfaut!$D$92,H169,DonnéesParDéfaut!$D$93,DonnéesParDéfaut!$D$89*DonnéesParDéfaut!$D$48*DonnéesParDéfaut!$D$90),0)","v":0},0,null,4,{"$f":"IF(M169<=DonnéesParDéfaut!$D$93,-IPMT(DonnéesParDéfaut!$D$92,M169,DonnéesParDéfaut!$D$93,DonnéesParDéfaut!$D$48*DonnéesParDéfaut!$D$89*DonnéesParDéfaut!$D$91),0)","v":3816925.757797976},{"$f":"IF(M169<=DonnéesParDéfaut!$D$93,-PPMT(DonnéesParDéfaut!$D$92,M169,DonnéesParDéfaut!$D$93,DonnéesParDéfaut!$D$89*DonnéesParDéfaut!$D$46*DonnéesParDéfaut!$D$91),0)","v":941411.69857029198},4758337.4563682675]
[null,null,5,{"$f":"IF(C170<=DonnéesParDéfaut!D$85,-IPMT(DonnéesParDéfaut!D$86,C170,DonnéesParDéfaut!D$85,DonnéesParDéfaut!D$48*DonnéesParDéfaut!D$84),0)","v":9337107.9919704888},{"$f":"IF(C170<=DonnéesParDéfaut!D$85,-PPMT(DonnéesParDéfaut!D$86,C170,DonnéesParDéfaut!D$85,DonnéesParDéfaut!D$84*DonnéesParDéfaut!D$48),0)","v":5369206.8383259969},14706314.830296487,null,5,{"$f":"IF(H170<=DonnéesParDéfaut!$D$93,-IPMT(DonnéesParDéfaut!$D$92,H170,DonnéesParDéfaut!$D$93,DonnéesParDéfaut!$D$48*DonnéesParDéfaut!$D$89*DonnéesParDéfaut!$D$90),0)","v":0},{"$f":"IF(H170<=DonnéesParDéfaut!$D$93,-PPMT(DonnéesParDéfaut!$D$92,H170,DonnéesParDéfaut!$D$93,DonnéesParDéfaut!$D$89*DonnéesParDéfaut!$D$48*DonnéesParDéfaut!$D$90),0)","v":0},0,null,5,{"$f":"IF(M170<=DonnéesParDéfaut!$D$93,-IPMT(DonnéesParDéfaut!$D$92,M170,DonnéesParDéfaut!$D$93,DonnéesParDéfaut!$D$48*DonnéesParDéfaut!$D$89*DonnéesParDéfaut!$D$91),0)","v":3722784.5879409472},{"$f":"IF(M170<=DonnéesParDéfaut!$D$93,-PPMT(DonnéesParDéfaut!$D$92,M170,DonnéesParDéfaut!$D$93,DonnéesParDéfaut!$D$89*DonnéesParDéfaut!$D$46*DonnéesParDéfaut!$D$91),0)","v":1035552.868427321},4758337.4563682685]
[null,null,6,{"$f":"IF(C171<=DonnéesParDéfaut!D$85,-IPMT(DonnéesParDéfaut!D$86,C171,DonnéesParDéfaut!D$85,DonnéesParDéfaut!D$48*DonnéesParDéfaut!D$84),0)","v":8988109.5474792961},{"$f":"IF(C171<=DonnéesParDéfaut!D$85,-PPMT(DonnéesParDéfaut!D$86,C171,DonnéesParDéfaut!D$85,DonnéesParDéfaut!D$84*DonnéesParDéfaut!D$48),0)","v":5718205.2828171868},14706314.830296483,null,6,{"$f":"IF(H171<=DonnéesParDéfaut!$D$93,-IPMT(DonnéesParDéfaut!$D$92,H171,DonnéesParDéfaut!$D$93,DonnéesParDéfaut!$D$48*DonnéesParDéfaut!$D$89*DonnéesParDéfaut!$D$90),0)","v":0},{"$f":"IF(H171<=DonnéesParDéfaut!$D$93,-PPMT(DonnéesParDéfaut!$D$92,H171,DonnéesParDéfaut!$D$93,DonnéesParDéfaut!$D$89*DonnéesParDéfaut!$D$48*DonnéesParDéfaut!$D$90),0)","v":0},0,null,6,{"$f":"IF(M171<=DonnéesParDéfaut!$D$93,-IPMT(DonnéesParDéfaut!$D$92,M171,DonnéesParDéfaut!$D$93,DonnéesParDéfaut!$D$48*DonnéesParDéfaut!$D$89*DonnéesParDéfaut!$D$91),0)","v":3619229.3010982145},{"$f":"IF(M171<=DonnéesParDéfaut!$D$93,-PPMT(DonnéesParDéfaut!$D$92,M171,DonnéesParDéfaut!$D$93,DonnéesParDéfaut!$D$89*DonnéesParDéfaut!$D$46*DonnéesParDéfaut!$D$91),0)","v":1139108.1552700528},4758337.4563682675]
[null,null,7,{"$f":"IF(C172<=DonnéesParDéfaut!D$85,-IPMT(DonnéesParDéfaut!D$86,C172,DonnéesParDéfaut!D$85,DonnéesParDéfaut!D$48*DonnéesParDéfaut!D$84),0)","v":8616426.2040961795},{"$f":"IF(C172<=DonnéesParDéfaut!D$85,-PPMT(DonnéesParDéfaut!D$86,C172,DonnéesParDéfaut!D$85,DonnéesParDéfaut!D$84*DonnéesParDéfaut!D$48),0)","v":6089888.6262003034},14706314.830296483,null,7,{"$f":"IF(H172<=DonnéesParDéfaut!$D$93,-IPMT(DonnéesParDéfaut!$D$92,H172,DonnéesParDéfaut!$D$93,DonnéesParDéfaut!$D$48*DonnéesParDéfaut!$D$89*DonnéesParDéfaut!$D$90),0)","v":0},{"$f":"IF(H172<=DonnéesParDéfaut!$D$93,-PPMT(DonnéesParDéfaut!$D$92,H172,DonnéesParDéfaut!$D$93,DonnéesParDéfaut!$D$89*DonnéesParDéfaut!$D$48*DonnéesParDéfaut!$D$90),0)","v":0},0,null,7,{"$f":"IF(M172<=DonnéesParDéfaut!$D$93,-IPMT(DonnéesParDéfaut!$D$92,M172,DonnéesParDéfaut!$D$93,DonnéesParDéfaut!$D$48*DonnéesParDéfaut!$D$89*DonnéesParDéfaut!$D$91),0)","v":3505318.4855712093},{"$f":"IF(M172<=DonnéesParDéfaut!$D$93,-PPMT(DonnéesParDéfaut!$D$92,M172,DonnéesParDéfaut!$D$93,DonnéesParDéfaut!$D$89*DonnéesParDéfaut!$D$46*DonnéesParDéfaut!$D$91),0)","v":1253018.9707970584},4758337.4563682675]
[null,null,8,{"$f":"IF(C173<=DonnéesParDéfaut!D$85,-IPMT(DonnéesParDéfaut!D$86,C173,DonnéesParDéfaut!D$85,DonnéesParDéfaut!D$48*DonnéesParDéfaut!D$84),0)","v":8220583.4433931615},{"$f":"IF(C173<=DonnéesParDéfaut!D$85,-PPMT(DonnéesParDéfaut!D$86,C173,DonnéesParDéfaut!D$85,DonnéesParDéfaut!D$84*DonnéesParDéfaut!D$48),0)","v":6485731.3869033242},14706314.830296487,null,8,{"$f":"IF(H173<=DonnéesParDéfaut!$D$93,-IPMT(DonnéesParDéfaut!$D$92,H173,DonnéesParDéfaut!$D$93,DonnéesParDéfaut!$D$48*DonnéesParDéfaut!$D$89*DonnéesParDéfaut!$D$90),0)","v":0},{"$f":"IF(H173<=DonnéesParDéfaut!$D$93,-PPMT(DonnéesParDéfaut!$D$92,H173,DonnéesParDéfaut!$D$93,DonnéesParDéfaut!$D$89*DonnéesParDéfaut!$D$48*DonnéesParDéfaut!$D$90),0)","v":0},0,null,8,{"$f":"IF(M173<=DonnéesParDéfaut!$D$93,-IPMT(DonnéesParDéfaut!$D$92,M173,DonnéesParDéfaut!$D$93,DonnéesParDéfaut!$D$48*DonnéesParDéfaut!$D$89*DonnéesParDéfaut!$D$91),0)","v":3380016.5884915041},{"$f":"IF(M173<=DonnéesParDéfaut!$D$93,-PPMT(DonnéesParDéfaut!$D$92,M173,DonnéesParDéfaut!$D$93,DonnéesParDéfaut!$D$89*DonnéesParDéfaut!$D$46*DonnéesParDéfaut!$D$91),0)","v":1378320.8678767642},4758337.4563682685]
[null,null,9,{"$f":"IF(C174<=DonnéesParDéfaut!D$85,-IPMT(DonnéesParDéfaut!D$86,C174,DonnéesParDéfaut!D$85,DonnéesParDéfaut!D$48*DonnéesParDéfaut!D$84),0)","v":7799010.9032444451},{"$f":"IF(C174<=DonnéesParDéfaut!D$85,-PPMT(DonnéesParDéfaut!D$86,C174,DonnéesParDéfaut!D$85,DonnéesParDéfaut!D$84*DonnéesParDéfaut!D$48),0)","v":6907303.9270520397},14706314.830296485,null,9,{"$f":"IF(H174<=DonnéesParDéfaut!$D$93,-IPMT(DonnéesParDéfaut!$D$92,H174,DonnéesParDéfaut!$D$93,DonnéesParDéfaut!$D$48*DonnéesParDéfaut!$D$89*DonnéesParDéfaut!$D$90),0)","v":0},{"$f":"IF(H174<=DonnéesParDéfaut!$D$93,-PPMT(DonnéesParDéfaut!$D$92,H174,DonnéesParDéfaut!$D$93,DonnéesParDéfaut!$D$89*DonnéesParDéfaut!$D$48*DonnéesParDéfaut!$D$90),0)","v":0},0,null,9,{"$f":"IF(M174<=DonnéesParDéfaut!$D$93,-IPMT(DonnéesParDéfaut!$D$92,M174,DonnéesParDéfaut!$D$93,DonnéesParDéfaut!$D$48*DonnéesParDéfaut!$D$89*DonnéesParDéfaut!$D$91),0)","v":3242184.5017038267},{"$f":"IF(M174<=DonnéesParDéfaut!$D$93,-PPMT(DonnéesParDéfaut!$D$92,M174,DonnéesParDéfaut!$D$93,DonnéesParDéfaut!$D$89*DonnéesParDéfaut!$D$46*DonnéesParDéfaut!$D$91),0)","v":1516152.9546644408},4758337.4563682675]
[null,null,10,{"$f":"IF(C175<=DonnéesParDéfaut!D$85,-IPMT(DonnéesParDéfaut!D$86,C175,DonnéesParDéfaut!D$85,DonnéesParDéfaut!D$48*DonnéesParDéfaut!D$84),0)","v":7350036.1479860637},{"$f":"IF(C175<=DonnéesParDéfaut!D$85,-PPMT(DonnéesParDéfaut!D$86,C175,DonnéesParDéfaut!D$85,DonnéesParDéfaut!D$84*DonnéesParDéfaut!D$48),0)","v":7356278.6823104229},14706314.830296487,null,10,{"$f":"IF(H175<=DonnéesParDéfaut!$D$93,-IPMT(DonnéesParDéfaut!$D$92,H175,DonnéesParDéfaut!$D$93,DonnéesParDéfaut!$D$48*DonnéesParDéfaut!$D$89*DonnéesParDéfaut!$D$90),0)","v":0},{"$f":"IF(H175<=DonnéesParDéfaut!$D$93,-PPMT(DonnéesParDéfaut!$D$92,H175,DonnéesParDéfaut!$D$93,DonnéesParDéfaut!$D$89*DonnéesParDéfaut!$D$48*DonnéesParDéfaut!$D$90),0)","v":0},0,null,10,{"$f":"IF(M175<=DonnéesParDéfaut!$D$93,-IPMT(DonnéesParDéfaut!$D$92,M175,DonnéesParDéfaut!$D$93,DonnéesParDéfaut!$D$48*DonnéesParDéfaut!$D$89*DonnéesParDéfaut!$D$91),0)","v":3090569.2062373832},{"$f":"IF(M175<=DonnéesParDéfaut!$D$93,-PPMT(DonnéesParDéfaut!$D$92,M175,DonnéesParDéfaut!$D$93,DonnéesParDéfaut!$D$89*DonnéesParDéfaut!$D$46*DonnéesParDéfaut!$D$91),0)","v":1667768.2501308846},4758337.4563682675]
[null,null,11,{"$f":"IF(C176<=DonnéesParDéfaut!D$85,-IPMT(DonnéesParDéfaut!D$86,C176,DonnéesParDéfaut!D$85,DonnéesParDéfaut!D$48*DonnéesParDéfaut!D$84),0)","v":6871878.0336358855},{"$f":"IF(C176<=DonnéesParDéfaut!D$85,-PPMT(DonnéesParDéfaut!D$86,C176,DonnéesParDéfaut!D$85,DonnéesParDéfaut!D$84*DonnéesParDéfaut!D$48),0)","v":7834436.7966606002},14706314.830296487,null,11,{"$f":"IF(H176<=DonnéesParDéfaut!$D$93,-IPMT(DonnéesParDéfaut!$D$92,H176,DonnéesParDéfaut!$D$93,DonnéesParDéfaut!$D$48*DonnéesParDéfaut!$D$89*DonnéesParDéfaut!$D$90),0)","v":0},{"$f":"IF(H176<=DonnéesParDéfaut!$D$93,-PPMT(DonnéesParDéfaut!$D$92,H176,DonnéesParDéfaut!$D$93,DonnéesParDéfaut!$D$89*DonnéesParDéfaut!$D$48*DonnéesParDéfaut!$D$90),0)","v":0},0,null,11,{"$f":"IF(M176<=DonnéesParDéfaut!$D$93,-IPMT(DonnéesParDéfaut!$D$92,M176,DonnéesParDéfaut!$D$93,DonnéesParDéfaut!$D$48*DonnéesParDéfaut!$D$89*DonnéesParDéfaut!$D$91),0)","v":2923792.3812242951},{"$f":"IF(M176<=DonnéesParDéfaut!$D$93,-PPMT(DonnéesParDéfaut!$D$92,M176,DonnéesParDéfaut!$D$93,DonnéesParDéfaut!$D$89*DonnéesParDéfaut!$D$48*DonnéesParDéfaut!$D$91),0)","v":1834545.0751439729},4758337.4563682675]
[null,null,12,{"$f":"IF(C177<=DonnéesParDéfaut!D$85,-IPMT(DonnéesParDéfaut!D$86,C177,DonnéesParDéfaut!D$85,DonnéesParDéfaut!D$48*DonnéesParDéfaut!D$84),0)","v":6362639.641852946},{"$f":"IF(C177<=DonnéesParDéfaut!D$85,-PPMT(DonnéesParDéfaut!D$86,C177,DonnéesParDéfaut!D$85,DonnéesParDéfaut!D$84*DonnéesParDéfaut!D$48),0)","v":8343675.1884435397},14706314.830296487,null,12,{"$f":"IF(H177<=DonnéesParDéfaut!$D$93,-IPMT(DonnéesParDéfaut!$D$92,H177,DonnéesParDéfaut!$D$93,DonnéesParDéfaut!$D$48*DonnéesParDéfaut!$D$89*DonnéesParDéfaut!$D$90),0)","v":0},{"$f":"IF(H177<=DonnéesParDéfaut!$D$93,-PPMT(DonnéesParDéfaut!$D$92,H177,DonnéesParDéfaut!$D$93,DonnéesParDéfaut!$D$89*DonnéesParDéfaut!$D$48*DonnéesParDéfaut!$D$90),0)","v":0},0,null,12,{"$f":"IF(M177<=DonnéesParDéfaut!$D$93,-IPMT(DonnéesParDéfaut!$D$92,M177,DonnéesParDéfaut!$D$93,DonnéesParDéfaut!$D$48*DonnéesParDéfaut!$D$89*DonnéesParDéfaut!$D$91),0)","v":2740337.8737098975},{"$f":"IF(M177<=DonnéesParDéfaut!$D$93,-PPMT(DonnéesParDéfaut!$D$92,M177,DonnéesParDéfaut!$D$93,DonnéesParDéfaut!$D$89*DonnéesParDéfaut!$D$48*DonnéesParDéfaut!$D$91),0)","v":2017999.5826583703},4758337.4563682675]
[null,null,13,{"$f":"IF(C178<=DonnéesParDéfaut!D$85,-IPMT(DonnéesParDéfaut!D$86,C178,DonnéesParDéfaut!D$85,DonnéesParDéfaut!D$48*DonnéesParDéfaut!D$84),0)","v":5820300.7546041161},{"$f":"IF(C178<=DonnéesParDéfaut!D$85,-PPMT(DonnéesParDéfaut!D$86,C178,DonnéesParDéfaut!D$85,DonnéesParDéfaut!D$84*DonnéesParDéfaut!D$48),0)","v":8886014.0756923705},14706314.830296487,null,13,{"$f":"IF(H178<=DonnéesParDéfaut!$D$93,-IPMT(DonnéesParDéfaut!$D$92,H178,DonnéesParDéfaut!$D$93,DonnéesParDéfaut!$D$48*DonnéesParDéfaut!$D$89*DonnéesParDéfaut!$D$90),0)","v":0},{"$f":"IF(H178<=DonnéesParDéfaut!$D$93,-PPMT(DonnéesParDéfaut!$D$92,H178,DonnéesParDéfaut!$D$93,DonnéesParDéfaut!$D$89*DonnéesParDéfaut!$D$48*DonnéesParDéfaut!$D$90),0)","v":0},0,null,13,{"$f":"IF(M178<=DonnéesParDéfaut!$D$93,-IPMT(DonnéesParDéfaut!$D$92,M178,DonnéesParDéfaut!$D$93,DonnéesParDéfaut!$D$48*DonnéesParDéfaut!$D$89*DonnéesParDéfaut!$D$91),0)","v":2538537.9154440602},{"$f":"IF(M178<=DonnéesParDéfaut!$D$93,-PPMT(DonnéesParDéfaut!$D$92,M178,DonnéesParDéfaut!$D$93,DonnéesParDéfaut!$D$89*DonnéesParDéfaut!$D$48*DonnéesParDéfaut!$D$91),0)","v":2219799.5409242073},4758337.4563682675]
[null,null,14,{"$f":"IF(C179<=DonnéesParDéfaut!D$85,-IPMT(DonnéesParDéfaut!D$86,C179,DonnéesParDéfaut!D$85,DonnéesParDéfaut!D$48*DonnéesParDéfaut!D$84),0)","v":5242709.839684112},{"$f":"IF(C179<=DonnéesParDéfaut!D$85,-PPMT(DonnéesParDéfaut!D$86,C179,DonnéesParDéfaut!D$85,DonnéesParDéfaut!D$84*DonnéesParDéfaut!D$48),0)","v":9463604.9906123746},14706314.830296487,null,14,{"$f":"IF(H179<=DonnéesParDéfaut!$D$93,-IPMT(DonnéesParDéfaut!$D$92,H179,DonnéesParDéfaut!$D$93,DonnéesParDéfaut!$D$48*DonnéesParDéfaut!$D$89*DonnéesParDéfaut!$D$90),0)","v":0},{"$f":"IF(H179<=DonnéesParDéfaut!$D$93,-PPMT(DonnéesParDéfaut!$D$92,H179,DonnéesParDéfaut!$D$93,DonnéesParDéfaut!$D$89*DonnéesParDéfaut!$D$48*DonnéesParDéfaut!$D$90),0)","v":0},0,null,14,{"$f":"IF(M179<=DonnéesParDéfaut!$D$93,-IPMT(DonnéesParDéfaut!$D$92,M179,DonnéesParDéfaut!$D$93,DonnéesParDéfaut!$D$48*DonnéesParDéfaut!$D$89*DonnéesParDéfaut!$D$91),0)","v":2316557.9613516396},{"$f":"IF(M179<=DonnéesParDéfaut!$D$93,-PPMT(DonnéesParDéfaut!$D$92,M179,DonnéesParDéfaut!$D$93,DonnéesParDéfaut!$D$89*DonnéesParDéfaut!$D$48*DonnéesParDéfaut!$D$91),0)","v":2441779.4950166284},4758337.4563682675]
[null,null,15,{"$f":"IF(C180<=DonnéesParDéfaut!D$85,-IPMT(DonnéesParDéfaut!D$86,C180,DonnéesParDéfaut!D$85,DonnéesParDéfaut!D$48*DonnéesParDéfaut!D$84),0)","v":4627575.5152943078},{"$f":"IF(C180<=DonnéesParDéfaut!D$85,-PPMT(DonnéesParDéfaut!D$86,C180,DonnéesParDéfaut!D$85,DonnéesParDéfaut!D$84*DonnéesParDéfaut!D$48),0)","v":10078739.315002179},14706314.830296487,null,15,{"$f":"IF(H180<=DonnéesParDéfaut!$D$93,-IPMT(DonnéesParDéfaut!$D$92,H180,DonnéesParDéfaut!$D$93,DonnéesParDéfaut!$D$48*DonnéesParDéfaut!$D$89*DonnéesParDéfaut!$D$90),0)","v":0},{"$f":"IF(H180<=DonnéesParDéfaut!$D$93,-PPMT(DonnéesParDéfaut!$D$92,H180,DonnéesParDéfaut!$D$93,DonnéesParDéfaut!$D$89*DonnéesParDéfaut!$D$48*DonnéesParDéfaut!$D$90),0)","v":0},0,null,15,{"$f":"IF(M180<=DonnéesParDéfaut!$D$93,-IPMT(DonnéesParDéfaut!$D$92,M180,DonnéesParDéfaut!$D$93,DonnéesParDéfaut!$D$48*DonnéesParDéfaut!$D$89*DonnéesParDéfaut!$D$91),0)","v":2072380.0118499768},{"$f":"IF(M180<=DonnéesParDéfaut!$D$93,-PPMT(DonnéesParDéfaut!$D$92,M180,DonnéesParDéfaut!$D$93,DonnéesParDéfaut!$D$89*DonnéesParDéfaut!$D$48*DonnéesParDéfaut!$D$91),0)","v":2685957.4445182909},4758337.4563682675]
[null,null,16,{"$f":"IF(C181<=DonnéesParDéfaut!D$85,-IPMT(DonnéesParDéfaut!D$86,C181,DonnéesParDéfaut!D$85,DonnéesParDéfaut!D$48*DonnéesParDéfaut!D$84),0)","v":3972457.4598191655},{"$f":"IF(C181<=DonnéesParDéfaut!D$85,-PPMT(DonnéesParDéfaut!D$86,C181,DonnéesParDéfaut!D$85,DonnéesParDéfaut!D$84*DonnéesParDéfaut!D$48),0)","v":10733857.370477319},14706314.830296485,null,16,{"$f":"IF(H181<=DonnéesParDéfaut!$D$93,-IPMT(DonnéesParDéfaut!$D$92,H181,DonnéesParDéfaut!$D$93,DonnéesParDéfaut!$D$48*DonnéesParDéfaut!$D$89*DonnéesParDéfaut!$D$90),0)","v":0},{"$f":"IF(H181<=DonnéesParDéfaut!$D$93,-PPMT(DonnéesParDéfaut!$D$92,H181,DonnéesParDéfaut!$D$93,DonnéesParDéfaut!$D$89*DonnéesParDéfaut!$D$48*DonnéesParDéfaut!$D$90),0)","v":0},0,null,16,{"$f":"IF(M181<=DonnéesParDéfaut!$D$93,-IPMT(DonnéesParDéfaut!$D$92,M181,DonnéesParDéfaut!$D$93,DonnéesParDéfaut!$D$48*DonnéesParDéfaut!$D$89*DonnéesParDéfaut!$D$91),0)","v":1803784.2673981478},{"$f":"IF(M181<=DonnéesParDéfaut!$D$93,-PPMT(DonnéesParDéfaut!$D$92,M181,DonnéesParDéfaut!$D$93,DonnéesParDéfaut!$D$89*DonnéesParDéfaut!$D$48*DonnéesParDéfaut!$D$91),0)","v":2954553.1889701197},4758337.4563682675]
[null,null,17,{"$f":"IF(C182<=DonnéesParDéfaut!D$85,-IPMT(DonnéesParDéfaut!D$86,C182,DonnéesParDéfaut!D$85,DonnéesParDéfaut!D$48*DonnéesParDéfaut!D$84),0)","v":3274756.7307381402},{"$f":"IF(C182<=DonnéesParDéfaut!D$85,-PPMT(DonnéesParDéfaut!D$86,C182,DonnéesParDéfaut!D$85,DonnéesParDéfaut!D$84*DonnéesParDéfaut!D$48),0)","v":11431558.099558344},14706314.830296485,null,17,{"$f":"IF(H182<=DonnéesParDéfaut!$D$93,-IPMT(DonnéesParDéfaut!$D$92,H182,DonnéesParDéfaut!$D$93,DonnéesParDéfaut!$D$48*DonnéesParDéfaut!$D$89*DonnéesParDéfaut!$D$90),0)","v":0},{"$f":"IF(H182<=DonnéesParDéfaut!$D$93,-PPMT(DonnéesParDéfaut!$D$92,H182,DonnéesParDéfaut!$D$93,DonnéesParDéfaut!$D$89*DonnéesParDéfaut!$D$48*DonnéesParDéfaut!$D$90),0)","v":0},0,null,17,{"$f":"IF(M182<=DonnéesParDéfaut!$D$93,-IPMT(DonnéesParDéfaut!$D$92,M182,DonnéesParDéfaut!$D$93,DonnéesParDéfaut!$D$48*DonnéesParDéfaut!$D$89*DonnéesParDéfaut!$D$91),0)","v":1508328.9485011359},{"$f":"IF(M182<=DonnéesParDéfaut!$D$93,-PPMT(DonnéesParDéfaut!$D$92,M182,DonnéesParDéfaut!$D$93,DonnéesParDéfaut!$D$89*DonnéesParDéfaut!$D$48*DonnéesParDéfaut!$D$91),0)","v":3250008.5078671323},4758337.4563682685]
[null,null,18,{"$f":"IF(C183<=DonnéesParDéfaut!D$85,-IPMT(DonnéesParDéfaut!D$86,C183,DonnéesParDéfaut!D$85,DonnéesParDéfaut!D$48*DonnéesParDéfaut!D$84),0)","v":2531705.454266848},{"$f":"IF(C183<=DonnéesParDéfaut!D$85,-PPMT(DonnéesParDéfaut!D$86,C183,DonnéesParDéfaut!D$85,DonnéesParDéfaut!D$84*DonnéesParDéfaut!D$48),0)","v":12174609.376029639},14706314.830296487,null,18,{"$f":"IF(H183<=DonnéesParDéfaut!$D$93,-IPMT(DonnéesParDéfaut!$D$92,H183,DonnéesParDéfaut!$D$93,DonnéesParDéfaut!$D$48*DonnéesParDéfaut!$D$89*DonnéesParDéfaut!$D$90),0)","v":0},{"$f":"IF(H183<=DonnéesParDéfaut!$D$93,-PPMT(DonnéesParDéfaut!$D$92,H183,DonnéesParDéfaut!$D$93,DonnéesParDéfaut!$D$89*DonnéesParDéfaut!$D$48*DonnéesParDéfaut!$D$90),0)","v":0},0,null,18,{"$f":"IF(M183<=DonnéesParDéfaut!$D$93,-IPMT(DonnéesParDéfaut!$D$92,M183,DonnéesParDéfaut!$D$93,DonnéesParDéfaut!$D$48*DonnéesParDéfaut!$D$89*DonnéesParDéfaut!$D$91),0)","v":1183328.0977144225},{"$f":"IF(M183<=DonnéesParDéfaut!$D$93,-PPMT(DonnéesParDéfaut!$D$92,M183,DonnéesParDéfaut!$D$93,DonnéesParDéfaut!$D$89*DonnéesParDéfaut!$D$48*DonnéesParDéfaut!$D$91),0)","v":3575009.3586538453},4758337.4563682675]
[null,null,19,{"$f":"IF(C184<=DonnéesParDéfaut!D$85,-IPMT(DonnéesParDéfaut!D$86,C184,DonnéesParDéfaut!D$85,DonnéesParDéfaut!D$48*DonnéesParDéfaut!D$84),0)","v":1740355.8448249211},{"$f":"IF(C184<=DonnéesParDéfaut!D$85,-PPMT(DonnéesParDéfaut!D$86,C184,DonnéesParDéfaut!D$85,DonnéesParDéfaut!D$84*DonnéesParDéfaut!D$48),0)","v":12965958.985471565},14706314.830296487,null,19,{"$f":"IF(H184<=DonnéesParDéfaut!$D$93,-IPMT(DonnéesParDéfaut!$D$92,H184,DonnéesParDéfaut!$D$93,DonnéesParDéfaut!$D$48*DonnéesParDéfaut!$D$89*DonnéesParDéfaut!$D$90),0)","v":0},{"$f":"IF(H184<=DonnéesParDéfaut!$D$93,-PPMT(DonnéesParDéfaut!$D$92,H184,DonnéesParDéfaut!$D$93,DonnéesParDéfaut!$D$89*DonnéesParDéfaut!$D$48*DonnéesParDéfaut!$D$90),0)","v":0},0,null,19,{"$f":"IF(M184<=DonnéesParDéfaut!$D$93,-IPMT(DonnéesParDéfaut!$D$92,M184,DonnéesParDéfaut!$D$93,DonnéesParDéfaut!$D$48*DonnéesParDéfaut!$D$89*DonnéesParDéfaut!$D$91),0)","v":825827.16184903809},{"$f":"IF(M184<=DonnéesParDéfaut!$D$93,-PPMT(DonnéesParDéfaut!$D$92,M184,DonnéesParDéfaut!$D$93,DonnéesParDéfaut!$D$89*DonnéesParDéfaut!$D$48*DonnéesParDéfaut!$D$91),0)","v":3932510.2945192293},4758337.4563682675]
[null,null,20,{"$f":"IF(C185<=DonnéesParDéfaut!D$85,-IPMT(DonnéesParDéfaut!D$86,C185,DonnéesParDéfaut!D$85,DonnéesParDéfaut!D$48*DonnéesParDéfaut!D$84),0)","v":897568.5107692692},{"$f":"IF(C185<=DonnéesParDéfaut!D$85,-PPMT(DonnéesParDéfaut!D$86,C185,DonnéesParDéfaut!D$85,DonnéesParDéfaut!D$84*DonnéesParDéfaut!D$48),0)","v":13808746.319527216},14706314.830296485,null,20,{"$f":"IF(H185<=DonnéesParDéfaut!$D$93,-IPMT(DonnéesParDéfaut!$D$92,H185,DonnéesParDéfaut!$D$93,DonnéesParDéfaut!$D$48*DonnéesParDéfaut!$D$89*DonnéesParDéfaut!$D$90),0)","v":0},{"$f":"IF(H185<=DonnéesParDéfaut!$D$93,-PPMT(DonnéesParDéfaut!$D$92,H185,DonnéesParDéfaut!$D$93,DonnéesParDéfaut!$D$89*DonnéesParDéfaut!$D$48*DonnéesParDéfaut!$D$90),0)","v":0},0,null,20,{"$f":"IF(M185<=DonnéesParDéfaut!$D$93,-IPMT(DonnéesParDéfaut!$D$92,M185,DonnéesParDéfaut!$D$93,DonnéesParDéfaut!$D$48*DonnéesParDéfaut!$D$89*DonnéesParDéfaut!$D$91),0)","v":432576.13239711517},{"$f":"IF(M185<=DonnéesParDéfaut!$D$93,-PPMT(DonnéesParDéfaut!$D$92,M185,DonnéesParDéfaut!$D$93,DonnéesParDéfaut!$D$89*DonnéesParDéfaut!$D$48*DonnéesParDéfaut!$D$91),0)","v":4325761.3239711523},4758337.4563682675]
[null,null,21,{"$f":"IF(C186<=DonnéesParDéfaut!D$85,-IPMT(DonnéesParDéfaut!D$86,C186,DonnéesParDéfaut!D$85,DonnéesParDéfaut!D$48*DonnéesParDéfaut!D$84),0)","v":0},{"$f":"IF(C186<=DonnéesParDéfaut!D$85,-PPMT(DonnéesParDéfaut!D$86,C186,DonnéesParDéfaut!D$85,DonnéesParDéfaut!D$84*DonnéesParDéfaut!D$48),0)","v":0},0,null,21,{"$f":"IF(H186<=DonnéesParDéfaut!$D$93,-IPMT(DonnéesParDéfaut!$D$92,H186,DonnéesParDéfaut!$D$93,DonnéesParDéfaut!$D$48*DonnéesParDéfaut!$D$89*DonnéesParDéfaut!$D$90),0)","v":0},{"$f":"IF(H186<=DonnéesParDéfaut!$D$93,-PPMT(DonnéesParDéfaut!$D$92,H186,DonnéesParDéfaut!$D$93,DonnéesParDéfaut!$D$89*DonnéesParDéfaut!$D$48*DonnéesParDéfaut!$D$90),0)","v":0},0,null,21,{"$f":"IF(M186<=DonnéesParDéfaut!$D$93,-IPMT(DonnéesParDéfaut!$D$92,M186,DonnéesParDéfaut!$D$93,DonnéesParDéfaut!$D$48*DonnéesParDéfaut!$D$89*DonnéesParDéfaut!$D$91),0)","v":0},{"$f":"IF(M186<=DonnéesParDéfaut!$D$93,-PPMT(DonnéesParDéfaut!$D$92,M186,DonnéesParDéfaut!$D$93,DonnéesParDéfaut!$D$89*DonnéesParDéfaut!$D$48*DonnéesParDéfaut!$D$91),0)","v":0},0]
[null,null,22,{"$f":"IF(C187<=DonnéesParDéfaut!D$85,-IPMT(DonnéesParDéfaut!D$86,C187,DonnéesParDéfaut!D$85,DonnéesParDéfaut!D$48*DonnéesParDéfaut!D$84),0)","v":0},{"$f":"IF(C187<=DonnéesParDéfaut!D$85,-PPMT(DonnéesParDéfaut!D$86,C187,DonnéesParDéfaut!D$85,DonnéesParDéfaut!D$84*DonnéesParDéfaut!D$48),0)","v":0},0,null,22,{"$f":"IF(H187<=DonnéesParDéfaut!$D$93,-IPMT(DonnéesParDéfaut!$D$92,H187,DonnéesParDéfaut!$D$93,DonnéesParDéfaut!$D$48*DonnéesParDéfaut!$D$89*DonnéesParDéfaut!$D$90),0)","v":0},{"$f":"IF(H187<=DonnéesParDéfaut!$D$93,-PPMT(DonnéesParDéfaut!$D$92,H187,DonnéesParDéfaut!$D$93,DonnéesParDéfaut!$D$89*DonnéesParDéfaut!$D$48*DonnéesParDéfaut!$D$90),0)","v":0},0,null,22,{"$f":"IF(M187<=DonnéesParDéfaut!$D$93,-IPMT(DonnéesParDéfaut!$D$92,M187,DonnéesParDéfaut!$D$93,DonnéesParDéfaut!$D$48*DonnéesParDéfaut!$D$89*DonnéesParDéfaut!$D$91),0)","v":0},{"$f":"IF(M187<=DonnéesParDéfaut!$D$93,-PPMT(DonnéesParDéfaut!$D$92,M187,DonnéesParDéfaut!$D$93,DonnéesParDéfaut!$D$89*DonnéesParDéfaut!$D$48*DonnéesParDéfaut!$D$91),0)","v":0},0]
[null,null,23,{"$f":"IF(C188<=DonnéesParDéfaut!D$85,-IPMT(DonnéesParDéfaut!D$86,C188,DonnéesParDéfaut!D$85,DonnéesParDéfaut!D$48*DonnéesParDéfaut!D$84),0)","v":0},{"$f":"IF(C188<=DonnéesParDéfaut!D$85,-PPMT(DonnéesParDéfaut!D$86,C188,DonnéesParDéfaut!D$85,DonnéesParDéfaut!D$84*DonnéesParDéfaut!D$48),0)","v":0},0,null,23,{"$f":"IF(H188<=DonnéesParDéfaut!$D$93,-IPMT(DonnéesParDéfaut!$D$92,H188,DonnéesParDéfaut!$D$93,DonnéesParDéfaut!$D$48*DonnéesParDéfaut!$D$89*DonnéesParDéfaut!$D$90),0)","v":0},{"$f":"IF(H188<=DonnéesParDéfaut!$D$93,-PPMT(DonnéesParDéfaut!$D$92,H188,DonnéesParDéfaut!$D$93,DonnéesParDéfaut!$D$89*DonnéesParDéfaut!$D$48*DonnéesParDéfaut!$D$90),0)","v":0},0,null,23,{"$f":"IF(M188<=DonnéesParDéfaut!$D$93,-IPMT(DonnéesParDéfaut!$D$92,M188,DonnéesParDéfaut!$D$93,DonnéesParDéfaut!$D$48*DonnéesParDéfaut!$D$89*DonnéesParDéfaut!$D$91),0)","v":0},{"$f":"IF(M188<=DonnéesParDéfaut!$D$93,-PPMT(DonnéesParDéfaut!$D$92,M188,DonnéesParDéfaut!$D$93,DonnéesParDéfaut!$D$89*DonnéesParDéfaut!$D$48*DonnéesParDéfaut!$D$91),0)","v":0},0]
[null,null,24,{"$f":"IF(C189<=DonnéesParDéfaut!D$85,-IPMT(DonnéesParDéfaut!D$86,C189,DonnéesParDéfaut!D$85,DonnéesParDéfaut!D$48*DonnéesParDéfaut!D$84),0)","v":0},{"$f":"IF(C189<=DonnéesParDéfaut!D$85,-PPMT(DonnéesParDéfaut!D$86,C189,DonnéesParDéfaut!D$85,DonnéesParDéfaut!D$84*DonnéesParDéfaut!D$48),0)","v":0},0,null,24,{"$f":"IF(H189<=DonnéesParDéfaut!$D$93,-IPMT(DonnéesParDéfaut!$D$92,H189,DonnéesParDéfaut!$D$93,DonnéesParDéfaut!$D$48*DonnéesParDéfaut!$D$89*DonnéesParDéfaut!$D$90),0)","v":0},{"$f":"IF(H189<=DonnéesParDéfaut!$D$93,-PPMT(DonnéesParDéfaut!$D$92,H189,DonnéesParDéfaut!$D$93,DonnéesParDéfaut!$D$89*DonnéesParDéfaut!$D$48*DonnéesParDéfaut!$D$90),0)","v":0},0,null,24,{"$f":"IF(M189<=DonnéesParDéfaut!$D$93,-IPMT(DonnéesParDéfaut!$D$92,M189,DonnéesParDéfaut!$D$93,DonnéesParDéfaut!$D$48*DonnéesParDéfaut!$D$89*DonnéesParDéfaut!$D$91),0)","v":0},{"$f":"IF(M189<=DonnéesParDéfaut!$D$93,-PPMT(DonnéesParDéfaut!$D$92,M189,DonnéesParDéfaut!$D$93,DonnéesParDéfaut!$D$89*DonnéesParDéfaut!$D$48*DonnéesParDéfaut!$D$91),0)","v":0},0]
[null,null,25,{"$f":"IF(C190<=DonnéesParDéfaut!D$85,-IPMT(DonnéesParDéfaut!D$86,C190,DonnéesParDéfaut!D$85,DonnéesParDéfaut!D$48*DonnéesParDéfaut!D$84),0)","v":0},{"$f":"IF(C190<=DonnéesParDéfaut!D$85,-PPMT(DonnéesParDéfaut!D$86,C190,DonnéesParDéfaut!D$85,DonnéesParDéfaut!D$84*DonnéesParDéfaut!D$48),0)","v":0},0,null,25,{"$f":"IF(H190<=DonnéesParDéfaut!$D$93,-IPMT(DonnéesParDéfaut!$D$92,H190,DonnéesParDéfaut!$D$93,DonnéesParDéfaut!$D$48*DonnéesParDéfaut!$D$89*DonnéesParDéfaut!$D$90),0)","v":0},{"$f":"IF(H190<=DonnéesParDéfaut!$D$93,-PPMT(DonnéesParDéfaut!$D$92,H190,DonnéesParDéfaut!$D$93,DonnéesParDéfaut!$D$89*DonnéesParDéfaut!$D$48*DonnéesParDéfaut!$D$90),0)","v":0},0,null,25,{"$f":"IF(M190<=DonnéesParDéfaut!$D$93,-IPMT(DonnéesParDéfaut!$D$92,M190,DonnéesParDéfaut!$D$93,DonnéesParDéfaut!$D$48*DonnéesParDéfaut!$D$89*DonnéesParDéfaut!$D$91),0)","v":0},{"$f":"IF(M190<=DonnéesParDéfaut!$D$93,-PPMT(DonnéesParDéfaut!$D$92,M190,DonnéesParDéfaut!$D$93,DonnéesParDéfaut!$D$89*DonnéesParDéfaut!$D$48*DonnéesParDéfaut!$D$91),0)","v":0},0]
[null,null,26,{"$f":"IF(C191<=DonnéesParDéfaut!D$85,-IPMT(DonnéesParDéfaut!D$86,C191,DonnéesParDéfaut!D$85,DonnéesParDéfaut!D$48*DonnéesParDéfaut!D$84),0)","v":0},{"$f":"IF(C191<=DonnéesParDéfaut!D$85,-PPMT(DonnéesParDéfaut!D$86,C191,DonnéesParDéfaut!D$85,DonnéesParDéfaut!D$84*DonnéesParDéfaut!D$48),0)","v":0},0,null,26,{"$f":"IF(H191<=DonnéesParDéfaut!$D$93,-IPMT(DonnéesParDéfaut!$D$92,H191,DonnéesParDéfaut!$D$93,DonnéesParDéfaut!$D$48*DonnéesParDéfaut!$D$89*DonnéesParDéfaut!$D$90),0)","v":0},{"$f":"IF(H191<=DonnéesParDéfaut!$D$93,-PPMT(DonnéesParDéfaut!$D$92,H191,DonnéesParDéfaut!$D$93,DonnéesParDéfaut!$D$89*DonnéesParDéfaut!$D$48*DonnéesParDéfaut!$D$90),0)","v":0},0,null,26,{"$f":"IF(M191<=DonnéesParDéfaut!$D$93,-IPMT(DonnéesParDéfaut!$D$92,M191,DonnéesParDéfaut!$D$93,DonnéesParDéfaut!$D$48*DonnéesParDéfaut!$D$89*DonnéesParDéfaut!$D$91),0)","v":0},{"$f":"IF(M191<=DonnéesParDéfaut!$D$93,-PPMT(DonnéesParDéfaut!$D$92,M191,DonnéesParDéfaut!$D$93,DonnéesParDéfaut!$D$89*DonnéesParDéfaut!$D$48*DonnéesParDéfaut!$D$91),0)","v":0},0]
[null,null,27,{"$f":"IF(C192<=DonnéesParDéfaut!D$85,-IPMT(DonnéesParDéfaut!D$86,C192,DonnéesParDéfaut!D$85,DonnéesParDéfaut!D$48*DonnéesParDéfaut!D$84),0)","v":0},{"$f":"IF(C192<=DonnéesParDéfaut!D$85,-PPMT(DonnéesParDéfaut!D$86,C192,DonnéesParDéfaut!D$85,DonnéesParDéfaut!D$84*DonnéesParDéfaut!D$48),0)","v":0},0,null,27,{"$f":"IF(H192<=DonnéesParDéfaut!$D$93,-IPMT(DonnéesParDéfaut!$D$92,H192,DonnéesParDéfaut!$D$93,DonnéesParDéfaut!$D$48*DonnéesParDéfaut!$D$89*DonnéesParDéfaut!$D$90),0)","v":0},{"$f":"IF(H192<=DonnéesParDéfaut!$D$93,-PPMT(DonnéesParDéfaut!$D$92,H192,DonnéesParDéfaut!$D$93,DonnéesParDéfaut!$D$89*DonnéesParDéfaut!$D$48*DonnéesParDéfaut!$D$90),0)","v":0},0,null,27,{"$f":"IF(M192<=DonnéesParDéfaut!$D$93,-IPMT(DonnéesParDéfaut!$D$92,M192,DonnéesParDéfaut!$D$93,DonnéesParDéfaut!$D$48*DonnéesParDéfaut!$D$89*DonnéesParDéfaut!$D$91),0)","v":0},{"$f":"IF(M192<=DonnéesParDéfaut!$D$93,-PPMT(DonnéesParDéfaut!$D$92,M192,DonnéesParDéfaut!$D$93,DonnéesParDéfaut!$D$89*DonnéesParDéfaut!$D$48*DonnéesParDéfaut!$D$91),0)","v":0},0]
[null,null,28,{"$f":"IF(C193<=DonnéesParDéfaut!D$85,-IPMT(DonnéesParDéfaut!D$86,C193,DonnéesParDéfaut!D$85,DonnéesParDéfaut!D$48*DonnéesParDéfaut!D$84),0)","v":0},{"$f":"IF(C193<=DonnéesParDéfaut!D$85,-PPMT(DonnéesParDéfaut!D$86,C193,DonnéesParDéfaut!D$85,DonnéesParDéfaut!D$84*DonnéesParDéfaut!D$48),0)","v":0},0,null,28,{"$f":"IF(H193<=DonnéesParDéfaut!$D$93,-IPMT(DonnéesParDéfaut!$D$92,H193,DonnéesParDéfaut!$D$93,DonnéesParDéfaut!$D$48*DonnéesParDéfaut!$D$89*DonnéesParDéfaut!$D$90),0)","v":0},{"$f":"IF(H193<=DonnéesParDéfaut!$D$93,-PPMT(DonnéesParDéfaut!$D$92,H193,DonnéesParDéfaut!$D$93,DonnéesParDéfaut!$D$89*DonnéesParDéfaut!$D$48*DonnéesParDéfaut!$D$90),0)","v":0},0,null,28,{"$f":"IF(M193<=DonnéesParDéfaut!$D$93,-IPMT(DonnéesParDéfaut!$D$92,M193,DonnéesParDéfaut!$D$93,DonnéesParDéfaut!$D$48*DonnéesParDéfaut!$D$89*DonnéesParDéfaut!$D$91),0)","v":0},{"$f":"IF(M193<=DonnéesParDéfaut!$D$93,-PPMT(DonnéesParDéfaut!$D$92,M193,DonnéesParDéfaut!$D$93,DonnéesParDéfaut!$D$89*DonnéesParDéfaut!$D$48*DonnéesParDéfaut!$D$91),0)","v":0},0]
[null,null,29,{"$f":"IF(C194<=DonnéesParDéfaut!D$85,-IPMT(DonnéesParDéfaut!D$86,C194,DonnéesParDéfaut!D$85,DonnéesParDéfaut!D$48*DonnéesParDéfaut!D$84),0)","v":0},{"$f":"IF(C194<=DonnéesParDéfaut!D$85,-PPMT(DonnéesParDéfaut!D$86,C194,DonnéesParDéfaut!D$85,DonnéesParDéfaut!D$84*DonnéesParDéfaut!D$48),0)","v":0},0,null,29,{"$f":"IF(H194<=DonnéesParDéfaut!$D$93,-IPMT(DonnéesParDéfaut!$D$92,H194,DonnéesParDéfaut!$D$93,DonnéesParDéfaut!$D$48*DonnéesParDéfaut!$D$89*DonnéesParDéfaut!$D$90),0)","v":0},{"$f":"IF(H194<=DonnéesParDéfaut!$D$93,-PPMT(DonnéesParDéfaut!$D$92,H194,DonnéesParDéfaut!$D$93,DonnéesParDéfaut!$D$89*DonnéesParDéfaut!$D$48*DonnéesParDéfaut!$D$90),0)","v":0},0,null,29,{"$f":"IF(M194<=DonnéesParDéfaut!$D$93,-IPMT(DonnéesParDéfaut!$D$92,M194,DonnéesParDéfaut!$D$93,DonnéesParDéfaut!$D$48*DonnéesParDéfaut!$D$89*DonnéesParDéfaut!$D$91),0)","v":0},{"$f":"IF(M194<=DonnéesParDéfaut!$D$93,-PPMT(DonnéesParDéfaut!$D$92,M194,DonnéesParDéfaut!$D$93,DonnéesParDéfaut!$D$89*DonnéesParDéfaut!$D$48*DonnéesParDéfaut!$D$91),0)","v":0},0]
[null,null,30,{"$f":"IF(C195<=DonnéesParDéfaut!D$85,-IPMT(DonnéesParDéfaut!D$86,C195,DonnéesParDéfaut!D$85,DonnéesParDéfaut!D$48*DonnéesParDéfaut!D$84),0)","v":0},{"$f":"IF(C195<=DonnéesParDéfaut!D$85,-PPMT(DonnéesParDéfaut!D$86,C195,DonnéesParDéfaut!D$85,DonnéesParDéfaut!D$84*DonnéesParDéfaut!D$48),0)","v":0},0,null,30,{"$f":"IF(H195<=DonnéesParDéfaut!$D$93,-IPMT(DonnéesParDéfaut!$D$92,H195,DonnéesParDéfaut!$D$93,DonnéesParDéfaut!$D$48*DonnéesParDéfaut!$D$89*DonnéesParDéfaut!$D$90),0)","v":0},{"$f":"IF(H195<=DonnéesParDéfaut!$D$93,-PPMT(DonnéesParDéfaut!$D$92,H195,DonnéesParDéfaut!$D$93,DonnéesParDéfaut!$D$89*DonnéesParDéfaut!$D$48*DonnéesParDéfaut!$D$90),0)","v":0},0,null,30,{"$f":"IF(M195<=DonnéesParDéfaut!$D$93,-IPMT(DonnéesParDéfaut!$D$92,M195,DonnéesParDéfaut!$D$93,DonnéesParDéfaut!$D$48*DonnéesParDéfaut!$D$89*DonnéesParDéfaut!$D$91),0)","v":0},{"$f":"IF(M195<=DonnéesParDéfaut!$D$93,-PPMT(DonnéesParDéfaut!$D$92,M195,DonnéesParDéfaut!$D$93,DonnéesParDéfaut!$D$89*DonnéesParDéfaut!$D$48*DonnéesParDéfaut!$D$91),0)","v":0},0]
[null,null,"Total",{"$f":"SUM(D166:D195)","v":132084660.06630918},{"$f":"SUM(E166:E195)","v":162041636.53962052},{"$f":"E196+D196","v":294126296.60592973},null,"Total",{"$f":"SUM(I166:I195)","v":0},{"$f":"SUM(J166:J195)","v":0},{"$f":"J196+I196","v":0},null,"Total",{"$f":"SUM(N166:N195)","v":54656339.992460221},{"$f":"SUM(O166:O195)","v":40510409.13490513},{"$f":"O196+N196","v":95166749.127365351}]
[null,null,"Moy. annuelle",{"$f":"D196/DonnéesParDéfaut!D$85","v":6604233.003315459},{"$f":"E196/DonnéesParDéfaut!D$85","v":8102081.8269810257},{"$f":"E197+D197","v":14706314.830296485},null,"Moy. annuelle",0,0,{"$f":"J197+I197","v":0},null,"Moy. annuelle",{"$f":"N196/DonnéesParDéfaut!$D$93","v":2732816.9996230109},{"$f":"O196/DonnéesParDéfaut!$D$93","v":2025520.4567452564},{"$f":"O197+N197","v":4758337.4563682675}]
[]
[null,null,"Révisé par l'utilisateur (à partir des données de la feuille Données projet (autres paramètres))",null,null,null,null,"Révisé par l'utilisateur",null,null,null,null,"Révisé par l'utilisateur"]
[null,null,"Dette - Calendrier de remboursement du prêt",null,null,null,null,"Capitaux propres - Calendrier de remboursement des investissements (particuliers)",null,null,null,null,"Capitaux propres - Calendrier de remboursement des investissements (entreprises)"]
[null,null,"Année"," Pmt intérêt","Pmt principal ","Pmt total",null,"Année"," Pmt intérêt","Pmt principal ","Pmt total",null,"Année"," Pmt intérêt","Pmt principal ","Pmt total"]
[null,null,1,{"$f":"IF(C202<=DonnéesProjet!B$89,-IPMT(DonnéesProjet!B$90,C202,DonnéesProjet!B$89,DonnéesProjet!B$88*DonnéesProjet!B$59),0)","v":10532706.375075337},{"$f":"IF(C202<=DonnéesProjet!B$89,-PPMT(DonnéesProjet!B$90,C202,DonnéesProjet!B$89,DonnéesProjet!B$59*DonnéesProjet!B$88),0)","v":4173608.4552211505},{"$f":"D202+E202","v":14706314.830296487},null,1,{"$f":"IF(H202<=DonnéesProjet!B$96,-ISPMT(DonnéesProjet!B$95,H202,DonnéesProjet!B$96,DonnéesProjet!B$59*DonnéesProjet!B$92*DonnéesProjet!B$93),0)","v":0},{"$f":"IF(H202<=DonnéesProjet!B$96,-PPMT(DonnéesProjet!B$95,H202,DonnéesProjet!B$96,DonnéesProjet!B$92*DonnéesProjet!B$59*DonnéesProjet!B$93),0)","v":0},{"$f":"I202+J202","v":0},null,1,{"$f":"IF(M202<=DonnéesProjet!$B$96,-IPMT(DonnéesProjet!$B$95,M202,DonnéesProjet!$B$96,DonnéesProjet!$B$59*DonnéesProjet!$B$92*DonnéesProjet!$B$94),0)","v":4051040.9134905133},{"$f":"IF(M202<=DonnéesProjet!$B$96,-PPMT(DonnéesProjet!$B$95,M202,DonnéesProjet!$B$96,DonnéesProjet!$B$92*DonnéesProjet!$B$59*DonnéesProjet!$B$94),0)","v":707296.54287775478},{"$f":"N202+O202","v":4758337.4563682685}]
[null,null,2,{"$f":"IF(C203<=DonnéesProjet!B$89,-IPMT(DonnéesProjet!B$90,C203,DonnéesProjet!B$89,DonnéesProjet!B$88*DonnéesProjet!B$59),0)","v":10261421.82548596},{"$f":"IF(C203<=DonnéesProjet!B$89,-PPMT(DonnéesProjet!B$90,C203,DonnéesProjet!B$89,DonnéesProjet!B$59*DonnéesProjet!B$88),0)","v":4444893.0048105251},{"$f":"D203+E203","v":14706314.830296485},null,2,{"$f":"IF(H203<=DonnéesProjet!B$96,-ISPMT(DonnéesProjet!B$95,H203,DonnéesProjet!B$96,DonnéesProjet!B$59*DonnéesProjet!B$92*DonnéesProjet!B$93),0)","v":0},{"$f":"IF(H203<=DonnéesProjet!B$96,-PPMT(DonnéesProjet!B$95,H203,DonnéesProjet!B$96,DonnéesProjet!B$92*DonnéesProjet!B$59*DonnéesProjet!B$93),0)","v":0},{"$f":"I203+J203","v":0},null,2,{"$f":"IF(M203<=DonnéesProjet!$B$96,-IPMT(DonnéesProjet!$B$95,M203,DonnéesProjet!$B$96,DonnéesProjet!$B$59*DonnéesProjet!$B$92*DonnéesProjet!$B$94),0)","v":3980311.2592027374},{"$f":"IF(M203<=DonnéesProjet!$B$96,-PPMT(DonnéesProjet!$B$95,M203,DonnéesProjet!$B$96,DonnéesProjet!$B$92*DonnéesProjet!$B$59*DonnéesProjet!$B$94),0)","v":778026.19716553052},{"$f":"N203+O203","v":4758337.4563682675}]
[null,null,3,{"$f":"IF(C204<=DonnéesProjet!B$89,-IPMT(DonnéesProjet!B$90,C204,DonnéesProjet!B$89,DonnéesProjet!B$88*DonnéesProjet!B$59),0)","v":9972503.7801732756},{"$f":"IF(C204<=DonnéesProjet!B$89,-PPMT(DonnéesProjet!B$90,C204,DonnéesProjet!B$89,DonnéesProjet!B$59*DonnéesProjet!B$88),0)","v":4733811.0501232091},14706314.830296485,null,3,{"$f":"IF(H204<=DonnéesProjet!B$96,-ISPMT(DonnéesProjet!B$95,H204,DonnéesProjet!B$96,DonnéesProjet!B$59*DonnéesProjet!B$92*DonnéesProjet!B$93),0)","v":0},{"$f":"IF(H204<=DonnéesProjet!B$96,-PPMT(DonnéesProjet!B$95,H204,DonnéesProjet!B$96,DonnéesProjet!B$92*DonnéesProjet!B$59*DonnéesProjet!B$93),0)","v":0},0,null,3,{"$f":"IF(M204<=DonnéesProjet!$B$96,-IPMT(DonnéesProjet!$B$95,M204,DonnéesProjet!$B$96,DonnéesProjet!$B$59*DonnéesProjet!$B$92*DonnéesProjet!$B$94),0)","v":3902508.6394861843},{"$f":"IF(M204<=DonnéesProjet!$B$96,-PPMT(DonnéesProjet!$B$95,M204,DonnéesProjet!$B$96,DonnéesProjet!$B$92*DonnéesProjet!$B$59*DonnéesProjet!$B$94),0)","v":855828.81688208343},4758337.4563682675]
[null,null,4,{"$f":"IF(C205<=DonnéesProjet!B$89,-IPMT(DonnéesProjet!B$90,C205,DonnéesProjet!B$89,DonnéesProjet!B$88*DonnéesProjet!B$59),0)","v":9664806.0619152673},{"$f":"IF(C205<=DonnéesProjet!B$89,-PPMT(DonnéesProjet!B$90,C205,DonnéesProjet!B$89,DonnéesProjet!B$59*DonnéesProjet!B$88),0)","v":5041508.7683812175},14706314.830296485,null,4,{"$f":"IF(H205<=DonnéesProjet!B$96,-ISPMT(DonnéesProjet!B$95,H205,DonnéesProjet!B$96,DonnéesProjet!B$59*DonnéesProjet!B$92*DonnéesProjet!B$93),0)","v":0},{"$f":"IF(H205<=DonnéesProjet!B$96,-PPMT(DonnéesProjet!B$95,H205,DonnéesProjet!B$96,DonnéesProjet!B$92*DonnéesProjet!B$59*DonnéesProjet!B$93),0)","v":0},0,null,4,{"$f":"IF(M205<=DonnéesProjet!$B$96,-IPMT(DonnéesProjet!$B$95,M205,DonnéesProjet!$B$96,DonnéesProjet!$B$59*DonnéesProjet!$B$92*DonnéesProjet!$B$94),0)","v":3816925.757797976},{"$f":"IF(M205<=DonnéesProjet!$B$96,-PPMT(DonnéesProjet!$B$95,M205,DonnéesProjet!$B$96,DonnéesProjet!$B$92*DonnéesProjet!$B$59*DonnéesProjet!$B$94),0)","v":941411.69857029198},4758337.4563682675]
[null,null,5,{"$f":"IF(C206<=DonnéesProjet!B$89,-IPMT(DonnéesProjet!B$90,C206,DonnéesProjet!B$89,DonnéesProjet!B$88*DonnéesProjet!B$59),0)","v":9337107.9919704888},{"$f":"IF(C206<=DonnéesProjet!B$89,-PPMT(DonnéesProjet!B$90,C206,DonnéesProjet!B$89,DonnéesProjet!B$59*DonnéesProjet!B$88),0)","v":5369206.8383259969},14706314.830296487,null,5,{"$f":"IF(H206<=DonnéesProjet!B$96,-ISPMT(DonnéesProjet!B$95,H206,DonnéesProjet!B$96,DonnéesProjet!B$59*DonnéesProjet!B$92*DonnéesProjet!B$93),0)","v":0},{"$f":"IF(H206<=DonnéesProjet!B$96,-PPMT(DonnéesProjet!B$95,H206,DonnéesProjet!B$96,DonnéesProjet!B$92*DonnéesProjet!B$59*DonnéesProjet!B$93),0)","v":0},0,null,5,{"$f":"IF(M206<=DonnéesProjet!$B$96,-IPMT(DonnéesProjet!$B$95,M206,DonnéesProjet!$B$96,DonnéesProjet!$B$59*DonnéesProjet!$B$92*DonnéesProjet!$B$94),0)","v":3722784.5879409472},{"$f":"IF(M206<=DonnéesProjet!$B$96,-PPMT(DonnéesProjet!$B$95,M206,DonnéesProjet!$B$96,DonnéesProjet!$B$92*DonnéesProjet!$B$59*DonnéesProjet!$B$94),0)","v":1035552.868427321},4758337.4563682685]
[null,null,6,{"$f":"IF(C207<=DonnéesProjet!B$89,-IPMT(DonnéesProjet!B$90,C207,DonnéesProjet!B$89,DonnéesProjet!B$88*DonnéesProjet!B$59),0)","v":8988109.5474792961},{"$f":"IF(C207<=DonnéesProjet!B$89,-PPMT(DonnéesProjet!B$90,C207,DonnéesProjet!B$89,DonnéesProjet!B$59*DonnéesProjet!B$88),0)","v":5718205.2828171868},14706314.830296483,null,6,{"$f":"IF(H207<=DonnéesProjet!B$96,-ISPMT(DonnéesProjet!B$95,H207,DonnéesProjet!B$96,DonnéesProjet!B$59*DonnéesProjet!B$92*DonnéesProjet!B$93),0)","v":0},{"$f":"IF(H207<=DonnéesProjet!B$96,-PPMT(DonnéesProjet!B$95,H207,DonnéesProjet!B$96,DonnéesProjet!B$92*DonnéesProjet!B$59*DonnéesProjet!B$93),0)","v":0},0,null,6,{"$f":"IF(M207<=DonnéesProjet!$B$96,-IPMT(DonnéesProjet!$B$95,M207,DonnéesProjet!$B$96,DonnéesProjet!$B$59*DonnéesProjet!$B$92*DonnéesProjet!$B$94),0)","v":3619229.3010982145},{"$f":"IF(M207<=DonnéesProjet!$B$96,-PPMT(DonnéesProjet!$B$95,M207,DonnéesProjet!$B$96,DonnéesProjet!$B$92*DonnéesProjet!$B$59*DonnéesProjet!$B$94),0)","v":1139108.1552700528},4758337.4563682675]
[null,null,7,{"$f":"IF(C208<=DonnéesProjet!B$89,-IPMT(DonnéesProjet!B$90,C208,DonnéesProjet!B$89,DonnéesProjet!B$88*DonnéesProjet!B$59),0)","v":8616426.2040961795},{"$f":"IF(C208<=DonnéesProjet!B$89,-PPMT(DonnéesProjet!B$90,C208,DonnéesProjet!B$89,DonnéesProjet!B$59*DonnéesProjet!B$88),0)","v":6089888.6262003034},14706314.830296483,null,7,{"$f":"IF(H208<=DonnéesProjet!B$96,-ISPMT(DonnéesProjet!B$95,H208,DonnéesProjet!B$96,DonnéesProjet!B$59*DonnéesProjet!B$92*DonnéesProjet!B$93),0)","v":0},{"$f":"IF(H208<=DonnéesProjet!B$96,-PPMT(DonnéesProjet!B$95,H208,DonnéesProjet!B$96,DonnéesProjet!B$92*DonnéesProjet!B$59*DonnéesProjet!B$93),0)","v":0},0,null,7,{"$f":"IF(M208<=DonnéesProjet!$B$96,-IPMT(DonnéesProjet!$B$95,M208,DonnéesProjet!$B$96,DonnéesProjet!$B$59*DonnéesProjet!$B$92*DonnéesProjet!$B$94),0)","v":3505318.4855712093},{"$f":"IF(M208<=DonnéesProjet!$B$96,-PPMT(DonnéesProjet!$B$95,M208,DonnéesProjet!$B$96,DonnéesProjet!$B$92*DonnéesProjet!$B$59*DonnéesProjet!$B$94),0)","v":1253018.9707970584},4758337.4563682675]
[null,null,8,{"$f":"IF(C209<=DonnéesProjet!B$89,-IPMT(DonnéesProjet!B$90,C209,DonnéesProjet!B$89,DonnéesProjet!B$88*DonnéesProjet!B$59),0)","v":8220583.4433931615},{"$f":"IF(C209<=DonnéesProjet!B$89,-PPMT(DonnéesProjet!B$90,C209,DonnéesProjet!B$89,DonnéesProjet!B$59*DonnéesProjet!B$88),0)","v":6485731.3869033242},14706314.830296487,null,8,{"$f":"IF(H209<=DonnéesProjet!B$96,-ISPMT(DonnéesProjet!B$95,H209,DonnéesProjet!B$96,DonnéesProjet!B$59*DonnéesProjet!B$92*DonnéesProjet!B$93),0)","v":0},{"$f":"IF(H209<=DonnéesProjet!B$96,-PPMT(DonnéesProjet!B$95,H209,DonnéesProjet!B$96,DonnéesProjet!B$92*DonnéesProjet!B$59*DonnéesProjet!B$93),0)","v":0},0,null,8,{"$f":"IF(M209<=DonnéesProjet!$B$96,-IPMT(DonnéesProjet!$B$95,M209,DonnéesProjet!$B$96,DonnéesProjet!$B$59*DonnéesProjet!$B$92*DonnéesProjet!$B$94),0)","v":3380016.5884915041},{"$f":"IF(M209<=DonnéesProjet!$B$96,-PPMT(DonnéesProjet!$B$95,M209,DonnéesProjet!$B$96,DonnéesProjet!$B$92*DonnéesProjet!$B$59*DonnéesProjet!$B$94),0)","v":1378320.8678767642},4758337.4563682685]
[null,null,9,{"$f":"IF(C210<=DonnéesProjet!B$89,-IPMT(DonnéesProjet!B$90,C210,DonnéesProjet!B$89,DonnéesProjet!B$88*DonnéesProjet!B$59),0)","v":7799010.9032444451},{"$f":"IF(C210<=DonnéesProjet!B$89,-PPMT(DonnéesProjet!B$90,C210,DonnéesProjet!B$89,DonnéesProjet!B$59*DonnéesProjet!B$88),0)","v":6907303.9270520397},14706314.830296485,null,9,{"$f":"IF(H210<=DonnéesProjet!B$96,-ISPMT(DonnéesProjet!B$95,H210,DonnéesProjet!B$96,DonnéesProjet!B$59*DonnéesProjet!B$92*DonnéesProjet!B$93),0)","v":0},{"$f":"IF(H210<=DonnéesProjet!B$96,-PPMT(DonnéesProjet!B$95,H210,DonnéesProjet!B$96,DonnéesProjet!B$92*DonnéesProjet!B$59*DonnéesProjet!B$93),0)","v":0},0,null,9,{"$f":"IF(M210<=DonnéesProjet!$B$96,-IPMT(DonnéesProjet!$B$95,M210,DonnéesProjet!$B$96,DonnéesProjet!$B$59*DonnéesProjet!$B$92*DonnéesProjet!$B$94),0)","v":3242184.5017038267},{"$f":"IF(M210<=DonnéesProjet!$B$96,-PPMT(DonnéesProjet!$B$95,M210,DonnéesProjet!$B$96,DonnéesProjet!$B$92*DonnéesProjet!$B$59*DonnéesProjet!$B$94),0)","v":1516152.9546644408},4758337.4563682675]
[null,null,10,{"$f":"IF(C211<=DonnéesProjet!B$89,-IPMT(DonnéesProjet!B$90,C211,DonnéesProjet!B$89,DonnéesProjet!B$88*DonnéesProjet!B$59),0)","v":7350036.1479860637},{"$f":"IF(C211<=DonnéesProjet!B$89,-PPMT(DonnéesProjet!B$90,C211,DonnéesProjet!B$89,DonnéesProjet!B$59*DonnéesProjet!B$88),0)","v":7356278.6823104229},14706314.830296487,null,10,{"$f":"IF(H211<=DonnéesProjet!B$96,-ISPMT(DonnéesProjet!B$95,H211,DonnéesProjet!B$96,DonnéesProjet!B$59*DonnéesProjet!B$92*DonnéesProjet!B$93),0)","v":0},{"$f":"IF(H211<=DonnéesProjet!B$96,-PPMT(DonnéesProjet!B$95,H211,DonnéesProjet!B$96,DonnéesProjet!B$92*DonnéesProjet!B$59*DonnéesProjet!B$93),0)","v":0},0,null,10,{"$f":"IF(M211<=DonnéesProjet!$B$96,-IPMT(DonnéesProjet!$B$95,M211,DonnéesProjet!$B$96,DonnéesProjet!$B$59*DonnéesProjet!$B$92*DonnéesProjet!$B$94),0)","v":3090569.2062373832},{"$f":"IF(M211<=DonnéesProjet!$B$96,-PPMT(DonnéesProjet!$B$95,M211,DonnéesProjet!$B$96,DonnéesProjet!$B$92*DonnéesProjet!$B$59*DonnéesProjet!$B$94),0)","v":1667768.2501308846},4758337.4563682675]
[null,null,11,{"$f":"IF(C212<=DonnéesProjet!B$89,-IPMT(DonnéesProjet!B$90,C212,DonnéesProjet!B$89,DonnéesProjet!B$88*DonnéesProjet!B$59),0)","v":6871878.0336358855},{"$f":"IF(C212<=DonnéesProjet!B$89,-PPMT(DonnéesProjet!B$90,C212,DonnéesProjet!B$89,DonnéesProjet!B$59*DonnéesProjet!B$88),0)","v":7834436.7966606002},14706314.830296487,null,11,{"$f":"IF(H212<=DonnéesProjet!B$96,-ISPMT(DonnéesProjet!B$95,H212,DonnéesProjet!B$96,DonnéesProjet!B$59*DonnéesProjet!B$92*DonnéesProjet!B$93),0)","v":0},{"$f":"IF(H212<=DonnéesProjet!B$96,-PPMT(DonnéesProjet!B$95,H212,DonnéesProjet!B$96,DonnéesProjet!B$92*DonnéesProjet!B$59*DonnéesProjet!B$93),0)","v":0},0,null,11,{"$f":"IF(M212<=DonnéesProjet!$B$96,-IPMT(DonnéesProjet!$B$95,M212,DonnéesProjet!$B$96,DonnéesProjet!$B$59*DonnéesProjet!$B$92*DonnéesProjet!$B$94),0)","v":2923792.3812242951},{"$f":"IF(M212<=DonnéesProjet!$B$96,-PPMT(DonnéesProjet!$B$95,M212,DonnéesProjet!$B$96,DonnéesProjet!$B$92*DonnéesProjet!$B$59*DonnéesProjet!$B$94),0)","v":1834545.0751439729},4758337.4563682675]
[null,null,12,{"$f":"IF(C213<=DonnéesProjet!B$89,-IPMT(DonnéesProjet!B$90,C213,DonnéesProjet!B$89,DonnéesProjet!B$88*DonnéesProjet!B$59),0)","v":6362639.641852946},{"$f":"IF(C213<=DonnéesProjet!B$89,-PPMT(DonnéesProjet!B$90,C213,DonnéesProjet!B$89,DonnéesProjet!B$59*DonnéesProjet!B$88),0)","v":8343675.1884435397},14706314.830296487,null,12,{"$f":"IF(H213<=DonnéesProjet!B$96,-ISPMT(DonnéesProjet!B$95,H213,DonnéesProjet!B$96,DonnéesProjet!B$59*DonnéesProjet!B$92*DonnéesProjet!B$93),0)","v":0},{"$f":"IF(H213<=DonnéesProjet!B$96,-PPMT(DonnéesProjet!B$95,H213,DonnéesProjet!B$96,DonnéesProjet!B$92*DonnéesProjet!B$59*DonnéesProjet!B$93),0)","v":0},0,null,12,{"$f":"IF(M213<=DonnéesProjet!$B$96,-IPMT(DonnéesProjet!$B$95,M213,DonnéesProjet!$B$96,DonnéesProjet!$B$59*DonnéesProjet!$B$92*DonnéesProjet!$B$94),0)","v":2740337.8737098975},{"$f":"IF(M213<=DonnéesProjet!$B$96,-PPMT(DonnéesProjet!$B$95,M213,DonnéesProjet!$B$96,DonnéesProjet!$B$92*DonnéesProjet!$B$59*DonnéesProjet!$B$94),0)","v":2017999.5826583703},4758337.4563682675]
[null,null,13,{"$f":"IF(C214<=DonnéesProjet!B$89,-IPMT(DonnéesProjet!B$90,C214,DonnéesProjet!B$89,DonnéesProjet!B$88*DonnéesProjet!B$59),0)","v":5820300.7546041161},{"$f":"IF(C214<=DonnéesProjet!B$89,-PPMT(DonnéesProjet!B$90,C214,DonnéesProjet!B$89,DonnéesProjet!B$59*DonnéesProjet!B$88),0)","v":8886014.0756923705},14706314.830296487,null,13,{"$f":"IF(H214<=DonnéesProjet!B$96,-ISPMT(DonnéesProjet!B$95,H214,DonnéesProjet!B$96,DonnéesProjet!B$59*DonnéesProjet!B$92*DonnéesProjet!B$93),0)","v":0},{"$f":"IF(H214<=DonnéesProjet!B$96,-PPMT(DonnéesProjet!B$95,H214,DonnéesProjet!B$96,DonnéesProjet!B$92*DonnéesProjet!B$59*DonnéesProjet!B$93),0)","v":0},0,null,13,{"$f":"IF(M214<=DonnéesProjet!$B$96,-IPMT(DonnéesProjet!$B$95,M214,DonnéesProjet!$B$96,DonnéesProjet!$B$59*DonnéesProjet!$B$92*DonnéesProjet!$B$94),0)","v":2538537.9154440602},{"$f":"IF(M214<=DonnéesProjet!$B$96,-PPMT(DonnéesProjet!$B$95,M214,DonnéesProjet!$B$96,DonnéesProjet!$B$92*DonnéesProjet!$B$59*DonnéesProjet!$B$94),0)","v":2219799.5409242073},4758337.4563682675]
[null,null,14,{"$f":"IF(C215<=DonnéesProjet!B$89,-IPMT(DonnéesProjet!B$90,C215,DonnéesProjet!B$89,DonnéesProjet!B$88*DonnéesProjet!B$59),0)","v":5242709.839684112},{"$f":"IF(C215<=DonnéesProjet!B$89,-PPMT(DonnéesProjet!B$90,C215,DonnéesProjet!B$89,DonnéesProjet!B$59*DonnéesProjet!B$88),0)","v":9463604.9906123746},14706314.830296487,null,14,{"$f":"IF(H215<=DonnéesProjet!B$96,-ISPMT(DonnéesProjet!B$95,H215,DonnéesProjet!B$96,DonnéesProjet!B$59*DonnéesProjet!B$92*DonnéesProjet!B$93),0)","v":0},{"$f":"IF(H215<=DonnéesProjet!B$96,-PPMT(DonnéesProjet!B$95,H215,DonnéesProjet!B$96,DonnéesProjet!B$92*DonnéesProjet!B$59*DonnéesProjet!B$93),0)","v":0},0,null,14,{"$f":"IF(M215<=DonnéesProjet!$B$96,-IPMT(DonnéesProjet!$B$95,M215,DonnéesProjet!$B$96,DonnéesProjet!$B$59*DonnéesProjet!$B$92*DonnéesProjet!$B$94),0)","v":2316557.9613516396},{"$f":"IF(M215<=DonnéesProjet!$B$96,-PPMT(DonnéesProjet!$B$95,M215,DonnéesProjet!$B$96,DonnéesProjet!$B$92*DonnéesProjet!$B$59*DonnéesProjet!$B$94),0)","v":2441779.4950166284},4758337.4563682675]
[null,null,15,{"$f":"IF(C216<=DonnéesProjet!B$89,-IPMT(DonnéesProjet!B$90,C216,DonnéesProjet!B$89,DonnéesProjet!B$88*DonnéesProjet!B$59),0)","v":4627575.5152943078},{"$f":"IF(C216<=DonnéesProjet!B$89,-PPMT(DonnéesProjet!B$90,C216,DonnéesProjet!B$89,DonnéesProjet!B$59*DonnéesProjet!B$88),0)","v":10078739.315002179},14706314.830296487,null,15,{"$f":"IF(H216<=DonnéesProjet!B$96,-ISPMT(DonnéesProjet!B$95,H216,DonnéesProjet!B$96,DonnéesProjet!B$59*DonnéesProjet!B$92*DonnéesProjet!B$93),0)","v":0},{"$f":"IF(H216<=DonnéesProjet!B$96,-PPMT(DonnéesProjet!B$95,H216,DonnéesProjet!B$96,DonnéesProjet!B$92*DonnéesProjet!B$59*DonnéesProjet!B$93),0)","v":0},0,null,15,{"$f":"IF(M216<=DonnéesProjet!$B$96,-IPMT(DonnéesProjet!$B$95,M216,DonnéesProjet!$B$96,DonnéesProjet!$B$59*DonnéesProjet!$B$92*DonnéesProjet!$B$94),0)","v":2072380.0118499768},{"$f":"IF(M216<=DonnéesProjet!$B$96,-PPMT(DonnéesProjet!$B$95,M216,DonnéesProjet!$B$96,DonnéesProjet!$B$92*DonnéesProjet!$B$59*DonnéesProjet!$B$94),0)","v":2685957.4445182909},4758337.4563682675]
[null,null,16,{"$f":"IF(C217<=DonnéesProjet!B$89,-IPMT(DonnéesProjet!B$90,C217,DonnéesProjet!B$89,DonnéesProjet!B$88*DonnéesProjet!B$59),0)","v":3972457.4598191655},{"$f":"IF(C217<=DonnéesProjet!B$89,-PPMT(DonnéesProjet!B$90,C217,DonnéesProjet!B$89,DonnéesProjet!B$59*DonnéesProjet!B$88),0)","v":10733857.370477319},14706314.830296485,null,16,{"$f":"IF(H217<=DonnéesProjet!B$96,-ISPMT(DonnéesProjet!B$95,H217,DonnéesProjet!B$96,DonnéesProjet!B$59*DonnéesProjet!B$92*DonnéesProjet!B$93),0)","v":0},{"$f":"IF(H217<=DonnéesProjet!B$96,-PPMT(DonnéesProjet!B$95,H217,DonnéesProjet!B$96,DonnéesProjet!B$92*DonnéesProjet!B$59*DonnéesProjet!B$93),0)","v":0},0,null,16,{"$f":"IF(M217<=DonnéesProjet!$B$96,-IPMT(DonnéesProjet!$B$95,M217,DonnéesProjet!$B$96,DonnéesProjet!$B$59*DonnéesProjet!$B$92*DonnéesProjet!$B$94),0)","v":1803784.2673981478},{"$f":"IF(M217<=DonnéesProjet!$B$96,-PPMT(DonnéesProjet!$B$95,M217,DonnéesProjet!$B$96,DonnéesProjet!$B$92*DonnéesProjet!$B$59*DonnéesProjet!$B$94),0)","v":2954553.1889701197},4758337.4563682675]
[null,null,17,{"$f":"IF(C218<=DonnéesProjet!B$89,-IPMT(DonnéesProjet!B$90,C218,DonnéesProjet!B$89,DonnéesProjet!B$88*DonnéesProjet!B$59),0)","v":3274756.7307381402},{"$f":"IF(C218<=DonnéesProjet!B$89,-PPMT(DonnéesProjet!B$90,C218,DonnéesProjet!B$89,DonnéesProjet!B$59*DonnéesProjet!B$88),0)","v":11431558.099558344},14706314.830296485,null,17,{"$f":"IF(H218<=DonnéesProjet!B$96,-ISPMT(DonnéesProjet!B$95,H218,DonnéesProjet!B$96,DonnéesProjet!B$59*DonnéesProjet!B$92*DonnéesProjet!B$93),0)","v":0},{"$f":"IF(H218<=DonnéesProjet!B$96,-PPMT(DonnéesProjet!B$95,H218,DonnéesProjet!B$96,DonnéesProjet!B$92*DonnéesProjet!B$59*DonnéesProjet!B$93),0)","v":0},0,null,17,{"$f":"IF(M218<=DonnéesProjet!$B$96,-IPMT(DonnéesProjet!$B$95,M218,DonnéesProjet!$B$96,DonnéesProjet!$B$59*DonnéesProjet!$B$92*DonnéesProjet!$B$94),0)","v":1508328.9485011359},{"$f":"IF(M218<=DonnéesProjet!$B$96,-PPMT(DonnéesProjet!$B$95,M218,DonnéesProjet!$B$96,DonnéesProjet!$B$92*DonnéesProjet!$B$59*DonnéesProjet!$B$94),0)","v":3250008.5078671323},4758337.4563682685]
[null,null,18,{"$f":"IF(C219<=DonnéesProjet!B$89,-IPMT(DonnéesProjet!B$90,C219,DonnéesProjet!B$89,DonnéesProjet!B$88*DonnéesProjet!B$59),0)","v":2531705.454266848},{"$f":"IF(C219<=DonnéesProjet!B$89,-PPMT(DonnéesProjet!B$90,C219,DonnéesProjet!B$89,DonnéesProjet!B$59*DonnéesProjet!B$88),0)","v":12174609.376029639},14706314.830296487,null,18,{"$f":"IF(H219<=DonnéesProjet!B$96,-ISPMT(DonnéesProjet!B$95,H219,DonnéesProjet!B$96,DonnéesProjet!B$59*DonnéesProjet!B$92*DonnéesProjet!B$93),0)","v":0},{"$f":"IF(H219<=DonnéesProjet!B$96,-PPMT(DonnéesProjet!B$95,H219,DonnéesProjet!B$96,DonnéesProjet!B$92*DonnéesProjet!B$59*DonnéesProjet!B$93),0)","v":0},0,null,18,{"$f":"IF(M219<=DonnéesProjet!$B$96,-IPMT(DonnéesProjet!$B$95,M219,DonnéesProjet!$B$96,DonnéesProjet!$B$59*DonnéesProjet!$B$92*DonnéesProjet!$B$94),0)","v":1183328.0977144225},{"$f":"IF(M219<=DonnéesProjet!$B$96,-PPMT(DonnéesProjet!$B$95,M219,DonnéesProjet!$B$96,DonnéesProjet!$B$92*DonnéesProjet!$B$59*DonnéesProjet!$B$94),0)","v":3575009.3586538453},4758337.4563682675]
[null,null,19,{"$f":"IF(C220<=DonnéesProjet!B$89,-IPMT(DonnéesProjet!B$90,C220,DonnéesProjet!B$89,DonnéesProjet!B$88*DonnéesProjet!B$59),0)","v":1740355.8448249211},{"$f":"IF(C220<=DonnéesProjet!B$89,-PPMT(DonnéesProjet!B$90,C220,DonnéesProjet!B$89,DonnéesProjet!B$59*DonnéesProjet!B$88),0)","v":12965958.985471565},14706314.830296487,null,19,{"$f":"IF(H220<=DonnéesProjet!B$96,-ISPMT(DonnéesProjet!B$95,H220,DonnéesProjet!B$96,DonnéesProjet!B$59*DonnéesProjet!B$92*DonnéesProjet!B$93),0)","v":0},{"$f":"IF(H220<=DonnéesProjet!B$96,-PPMT(DonnéesProjet!B$95,H220,DonnéesProjet!B$96,DonnéesProjet!B$92*DonnéesProjet!B$59*DonnéesProjet!B$93),0)","v":0},0,null,19,{"$f":"IF(M220<=DonnéesProjet!$B$96,-IPMT(DonnéesProjet!$B$95,M220,DonnéesProjet!$B$96,DonnéesProjet!$B$59*DonnéesProjet!$B$92*DonnéesProjet!$B$94),0)","v":825827.16184903809},{"$f":"IF(M220<=DonnéesProjet!$B$96,-PPMT(DonnéesProjet!$B$95,M220,DonnéesProjet!$B$96,DonnéesProjet!$B$92*DonnéesProjet!$B$59*DonnéesProjet!$B$94),0)","v":3932510.2945192293},4758337.4563682675]
[null,null,20,{"$f":"IF(C221<=DonnéesProjet!B$89,-IPMT(DonnéesProjet!B$90,C221,DonnéesProjet!B$89,DonnéesProjet!B$88*DonnéesProjet!B$59),0)","v":897568.5107692692},{"$f":"IF(C221<=DonnéesProjet!B$89,-PPMT(DonnéesProjet!B$90,C221,DonnéesProjet!B$89,DonnéesProjet!B$59*DonnéesProjet!B$88),0)","v":13808746.319527216},14706314.830296485,null,20,{"$f":"IF(H221<=DonnéesProjet!B$96,-ISPMT(DonnéesProjet!B$95,H221,DonnéesProjet!B$96,DonnéesProjet!B$59*DonnéesProjet!B$92*DonnéesProjet!B$93),0)","v":0},{"$f":"IF(H221<=DonnéesProjet!B$96,-PPMT(DonnéesProjet!B$95,H221,DonnéesProjet!B$96,DonnéesProjet!B$92*DonnéesProjet!B$59*DonnéesProjet!B$93),0)","v":0},0,null,20,{"$f":"IF(M221<=DonnéesProjet!$B$96,-IPMT(DonnéesProjet!$B$95,M221,DonnéesProjet!$B$96,DonnéesProjet!$B$59*DonnéesProjet!$B$92*DonnéesProjet!$B$94),0)","v":432576.13239711517},{"$f":"IF(M221<=DonnéesProjet!$B$96,-PPMT(DonnéesProjet!$B$95,M221,DonnéesProjet!$B$96,DonnéesProjet!$B$92*DonnéesProjet!$B$59*DonnéesProjet!$B$94),0)","v":4325761.3239711523},4758337.4563682675]
[null,null,21,{"$f":"IF(C222<=DonnéesProjet!B$89,-IPMT(DonnéesProjet!B$90,C222,DonnéesProjet!B$89,DonnéesProjet!B$88*DonnéesProjet!B$59),0)","v":0},{"$f":"IF(C222<=DonnéesProjet!B$89,-PPMT(DonnéesProjet!B$90,C222,DonnéesProjet!B$89,DonnéesProjet!B$59*DonnéesProjet!B$88),0)","v":0},0,null,21,{"$f":"IF(H222<=DonnéesProjet!B$96,-ISPMT(DonnéesProjet!B$95,H222,DonnéesProjet!B$96,DonnéesProjet!B$59*DonnéesProjet!B$92*DonnéesProjet!B$93),0)","v":0},{"$f":"IF(H222<=DonnéesProjet!B$96,-PPMT(DonnéesProjet!B$95,H222,DonnéesProjet!B$96,DonnéesProjet!B$92*DonnéesProjet!B$59*DonnéesProjet!B$93),0)","v":0},0,null,21,{"$f":"IF(M222<=DonnéesProjet!$B$96,-IPMT(DonnéesProjet!$B$95,M222,DonnéesProjet!$B$96,DonnéesProjet!$B$59*DonnéesProjet!$B$92*DonnéesProjet!$B$94),0)","v":0},{"$f":"IF(M222<=DonnéesProjet!$B$96,-PPMT(DonnéesProjet!$B$95,M222,DonnéesProjet!$B$96,DonnéesProjet!$B$92*DonnéesProjet!$B$59*DonnéesProjet!$B$94),0)","v":0},0]
[null,null,22,{"$f":"IF(C223<=DonnéesProjet!B$89,-IPMT(DonnéesProjet!B$90,C223,DonnéesProjet!B$89,DonnéesProjet!B$88*DonnéesProjet!B$59),0)","v":0},{"$f":"IF(C223<=DonnéesProjet!B$89,-PPMT(DonnéesProjet!B$90,C223,DonnéesProjet!B$89,DonnéesProjet!B$59*DonnéesProjet!B$88),0)","v":0},0,null,22,{"$f":"IF(H223<=DonnéesProjet!B$96,-ISPMT(DonnéesProjet!B$95,H223,DonnéesProjet!B$96,DonnéesProjet!B$59*DonnéesProjet!B$92*DonnéesProjet!B$93),0)","v":0},{"$f":"IF(H223<=DonnéesProjet!B$96,-PPMT(DonnéesProjet!B$95,H223,DonnéesProjet!B$96,DonnéesProjet!B$92*DonnéesProjet!B$59*DonnéesProjet!B$93),0)","v":0},0,null,22,{"$f":"IF(M223<=DonnéesProjet!$B$96,-IPMT(DonnéesProjet!$B$95,M223,DonnéesProjet!$B$96,DonnéesProjet!$B$59*DonnéesProjet!$B$92*DonnéesProjet!$B$94),0)","v":0},{"$f":"IF(M223<=DonnéesProjet!$B$96,-PPMT(DonnéesProjet!$B$95,M223,DonnéesProjet!$B$96,DonnéesProjet!$B$92*DonnéesProjet!$B$59*DonnéesProjet!$B$94),0)","v":0},0]
[null,null,23,{"$f":"IF(C224<=DonnéesProjet!B$89,-IPMT(DonnéesProjet!B$90,C224,DonnéesProjet!B$89,DonnéesProjet!B$88*DonnéesProjet!B$59),0)","v":0},{"$f":"IF(C224<=DonnéesProjet!B$89,-PPMT(DonnéesProjet!B$90,C224,DonnéesProjet!B$89,DonnéesProjet!B$59*DonnéesProjet!B$88),0)","v":0},0,null,23,{"$f":"IF(H224<=DonnéesProjet!B$96,-ISPMT(DonnéesProjet!B$95,H224,DonnéesProjet!B$96,DonnéesProjet!B$59*DonnéesProjet!B$92*DonnéesProjet!B$93),0)","v":0},{"$f":"IF(H224<=DonnéesProjet!B$96,-PPMT(DonnéesProjet!B$95,H224,DonnéesProjet!B$96,DonnéesProjet!B$92*DonnéesProjet!B$59*DonnéesProjet!B$93),0)","v":0},0,null,23,{"$f":"IF(M224<=DonnéesProjet!$B$96,-IPMT(DonnéesProjet!$B$95,M224,DonnéesProjet!$B$96,DonnéesProjet!$B$59*DonnéesProjet!$B$92*DonnéesProjet!$B$94),0)","v":0},{"$f":"IF(M224<=DonnéesProjet!$B$96,-PPMT(DonnéesProjet!$B$95,M224,DonnéesProjet!$B$96,DonnéesProjet!$B$92*DonnéesProjet!$B$59*DonnéesProjet!$B$94),0)","v":0},0]
[null,null,24,{"$f":"IF(C225<=DonnéesProjet!B$89,-IPMT(DonnéesProjet!B$90,C225,DonnéesProjet!B$89,DonnéesProjet!B$88*DonnéesProjet!B$59),0)","v":0},{"$f":"IF(C225<=DonnéesProjet!B$89,-PPMT(DonnéesProjet!B$90,C225,DonnéesProjet!B$89,DonnéesProjet!B$59*DonnéesProjet!B$88),0)","v":0},0,null,24,{"$f":"IF(H225<=DonnéesProjet!B$96,-ISPMT(DonnéesProjet!B$95,H225,DonnéesProjet!B$96,DonnéesProjet!B$59*DonnéesProjet!B$92*DonnéesProjet!B$93),0)","v":0},{"$f":"IF(H225<=DonnéesProjet!B$96,-PPMT(DonnéesProjet!B$95,H225,DonnéesProjet!B$96,DonnéesProjet!B$92*DonnéesProjet!B$59*DonnéesProjet!B$93),0)","v":0},0,null,24,{"$f":"IF(M225<=DonnéesProjet!$B$96,-IPMT(DonnéesProjet!$B$95,M225,DonnéesProjet!$B$96,DonnéesProjet!$B$59*DonnéesProjet!$B$92*DonnéesProjet!$B$94),0)","v":0},{"$f":"IF(M225<=DonnéesProjet!$B$96,-PPMT(DonnéesProjet!$B$95,M225,DonnéesProjet!$B$96,DonnéesProjet!$B$92*DonnéesProjet!$B$59*DonnéesProjet!$B$94),0)","v":0},0]
[null,null,25,{"$f":"IF(C226<=DonnéesProjet!B$89,-IPMT(DonnéesProjet!B$90,C226,DonnéesProjet!B$89,DonnéesProjet!B$88*DonnéesProjet!B$59),0)","v":0},{"$f":"IF(C226<=DonnéesProjet!B$89,-PPMT(DonnéesProjet!B$90,C226,DonnéesProjet!B$89,DonnéesProjet!B$59*DonnéesProjet!B$88),0)","v":0},0,null,25,{"$f":"IF(H226<=DonnéesProjet!B$96,-ISPMT(DonnéesProjet!B$95,H226,DonnéesProjet!B$96,DonnéesProjet!B$59*DonnéesProjet!B$92*DonnéesProjet!B$93),0)","v":0},{"$f":"IF(H226<=DonnéesProjet!B$96,-PPMT(DonnéesProjet!B$95,H226,DonnéesProjet!B$96,DonnéesProjet!B$92*DonnéesProjet!B$59*DonnéesProjet!B$93),0)","v":0},0,null,25,{"$f":"IF(M226<=DonnéesProjet!$B$96,-IPMT(DonnéesProjet!$B$95,M226,DonnéesProjet!$B$96,DonnéesProjet!$B$59*DonnéesProjet!$B$92*DonnéesProjet!$B$94),0)","v":0},{"$f":"IF(M226<=DonnéesProjet!$B$96,-PPMT(DonnéesProjet!$B$95,M226,DonnéesProjet!$B$96,DonnéesProjet!$B$92*DonnéesProjet!$B$59*DonnéesProjet!$B$94),0)","v":0},0]
[null,null,26,{"$f":"IF(C227<=DonnéesProjet!B$89,-IPMT(DonnéesProjet!B$90,C227,DonnéesProjet!B$89,DonnéesProjet!B$88*DonnéesProjet!B$59),0)","v":0},{"$f":"IF(C227<=DonnéesProjet!B$89,-PPMT(DonnéesProjet!B$90,C227,DonnéesProjet!B$89,DonnéesProjet!B$59*DonnéesProjet!B$88),0)","v":0},0,null,26,{"$f":"IF(H227<=DonnéesProjet!B$96,-ISPMT(DonnéesProjet!B$95,H227,DonnéesProjet!B$96,DonnéesProjet!B$59*DonnéesProjet!B$92*DonnéesProjet!B$93),0)","v":0},{"$f":"IF(H227<=DonnéesProjet!B$96,-PPMT(DonnéesProjet!B$95,H227,DonnéesProjet!B$96,DonnéesProjet!B$92*DonnéesProjet!B$59*DonnéesProjet!B$93),0)","v":0},0,null,26,{"$f":"IF(M227<=DonnéesProjet!$B$96,-IPMT(DonnéesProjet!$B$95,M227,DonnéesProjet!$B$96,DonnéesProjet!$B$59*DonnéesProjet!$B$92*DonnéesProjet!$B$94),0)","v":0},{"$f":"IF(M227<=DonnéesProjet!$B$96,-PPMT(DonnéesProjet!$B$95,M227,DonnéesProjet!$B$96,DonnéesProjet!$B$92*DonnéesProjet!$B$59*DonnéesProjet!$B$94),0)","v":0},0]
[null,null,27,{"$f":"IF(C228<=DonnéesProjet!B$89,-IPMT(DonnéesProjet!B$90,C228,DonnéesProjet!B$89,DonnéesProjet!B$88*DonnéesProjet!B$59),0)","v":0},{"$f":"IF(C228<=DonnéesProjet!B$89,-PPMT(DonnéesProjet!B$90,C228,DonnéesProjet!B$89,DonnéesProjet!B$59*DonnéesProjet!B$88),0)","v":0},0,null,27,{"$f":"IF(H228<=DonnéesProjet!B$96,-ISPMT(DonnéesProjet!B$95,H228,DonnéesProjet!B$96,DonnéesProjet!B$59*DonnéesProjet!B$92*DonnéesProjet!B$93),0)","v":0},{"$f":"IF(H228<=DonnéesProjet!B$96,-PPMT(DonnéesProjet!B$95,H228,DonnéesProjet!B$96,DonnéesProjet!B$92*DonnéesProjet!B$59*DonnéesProjet!B$93),0)","v":0},0,null,27,{"$f":"IF(M228<=DonnéesProjet!$B$96,-IPMT(DonnéesProjet!$B$95,M228,DonnéesProjet!$B$96,DonnéesProjet!$B$59*DonnéesProjet!$B$92*DonnéesProjet!$B$94),0)","v":0},{"$f":"IF(M228<=DonnéesProjet!$B$96,-PPMT(DonnéesProjet!$B$95,M228,DonnéesProjet!$B$96,DonnéesProjet!$B$92*DonnéesProjet!$B$59*DonnéesProjet!$B$94),0)","v":0},0]
[null,null,28,{"$f":"IF(C229<=DonnéesProjet!B$89,-IPMT(DonnéesProjet!B$90,C229,DonnéesProjet!B$89,DonnéesProjet!B$88*DonnéesProjet!B$59),0)","v":0},{"$f":"IF(C229<=DonnéesProjet!B$89,-PPMT(DonnéesProjet!B$90,C229,DonnéesProjet!B$89,DonnéesProjet!B$59*DonnéesProjet!B$88),0)","v":0},0,null,28,{"$f":"IF(H229<=DonnéesProjet!B$96,-ISPMT(DonnéesProjet!B$95,H229,DonnéesProjet!B$96,DonnéesProjet!B$59*DonnéesProjet!B$92*DonnéesProjet!B$93),0)","v":0},{"$f":"IF(H229<=DonnéesProjet!B$96,-PPMT(DonnéesProjet!B$95,H229,DonnéesProjet!B$96,DonnéesProjet!B$92*DonnéesProjet!B$59*DonnéesProjet!B$93),0)","v":0},0,null,28,{"$f":"IF(M229<=DonnéesProjet!$B$96,-IPMT(DonnéesProjet!$B$95,M229,DonnéesProjet!$B$96,DonnéesProjet!$B$59*DonnéesProjet!$B$92*DonnéesProjet!$B$94),0)","v":0},{"$f":"IF(M229<=DonnéesProjet!$B$96,-PPMT(DonnéesProjet!$B$95,M229,DonnéesProjet!$B$96,DonnéesProjet!$B$92*DonnéesProjet!$B$59*DonnéesProjet!$B$94),0)","v":0},0]
[null,null,29,{"$f":"IF(C230<=DonnéesProjet!B$89,-IPMT(DonnéesProjet!B$90,C230,DonnéesProjet!B$89,DonnéesProjet!B$88*DonnéesProjet!B$59),0)","v":0},{"$f":"IF(C230<=DonnéesProjet!B$89,-PPMT(DonnéesProjet!B$90,C230,DonnéesProjet!B$89,DonnéesProjet!B$59*DonnéesProjet!B$88),0)","v":0},0,null,29,{"$f":"IF(H230<=DonnéesProjet!B$96,-ISPMT(DonnéesProjet!B$95,H230,DonnéesProjet!B$96,DonnéesProjet!B$59*DonnéesProjet!B$92*DonnéesProjet!B$93),0)","v":0},{"$f":"IF(H230<=DonnéesProjet!B$96,-PPMT(DonnéesProjet!B$95,H230,DonnéesProjet!B$96,DonnéesProjet!B$92*DonnéesProjet!B$59*DonnéesProjet!B$93),0)","v":0},0,null,29,{"$f":"IF(M230<=DonnéesProjet!$B$96,-IPMT(DonnéesProjet!$B$95,M230,DonnéesProjet!$B$96,DonnéesProjet!$B$59*DonnéesProjet!$B$92*DonnéesProjet!$B$94),0)","v":0},{"$f":"IF(M230<=DonnéesProjet!$B$96,-PPMT(DonnéesProjet!$B$95,M230,DonnéesProjet!$B$96,DonnéesProjet!$B$92*DonnéesProjet!$B$59*DonnéesProjet!$B$94),0)","v":0},0]
[null,null,30,{"$f":"IF(C231<=DonnéesProjet!B$89,-IPMT(DonnéesProjet!B$90,C231,DonnéesProjet!B$89,DonnéesProjet!B$88*DonnéesProjet!B$59),0)","v":0},{"$f":"IF(C231<=DonnéesProjet!B$89,-PPMT(DonnéesProjet!B$90,C231,DonnéesProjet!B$89,DonnéesProjet!B$59*DonnéesProjet!B$88),0)","v":0},0,null,30,{"$f":"IF(H231<=DonnéesProjet!B$96,-ISPMT(DonnéesProjet!B$95,H231,DonnéesProjet!B$96,DonnéesProjet!B$59*DonnéesProjet!B$92*DonnéesProjet!B$93),0)","v":0},{"$f":"IF(H231<=DonnéesProjet!B$96,-PPMT(DonnéesProjet!B$95,H231,DonnéesProjet!B$96,DonnéesProjet!B$92*DonnéesProjet!B$59*DonnéesProjet!B$93),0)","v":0},0,null,30,{"$f":"IF(M231<=DonnéesProjet!$B$96,-IPMT(DonnéesProjet!$B$95,M231,DonnéesProjet!$B$96,DonnéesProjet!$B$59*DonnéesProjet!$B$92*DonnéesProjet!$B$94),0)","v":0},{"$f":"IF(M231<=DonnéesProjet!$B$96,-PPMT(DonnéesProjet!$B$95,M231,DonnéesProjet!$B$96,DonnéesProjet!$B$92*DonnéesProjet!$B$59*DonnéesProjet!$B$94),0)","v":0},0]
[null,null,"Total",{"$f":"SUM(D202:D231)","v":132084660.06630918},{"$f":"SUM(E202:E231)","v":162041636.53962052},{"$f":"E232+D232","v":294126296.60592973},null,"Total",{"$f":"SUM(I202:I231)","v":0},{"$f":"SUM(J202:J231)","v":0},{"$f":"I232+J232","v":0},null,"Total",{"$f":"SUM(N202:N231)","v":54656339.992460221},{"$f":"SUM(O202:O231)","v":40510409.13490513},{"$f":"N232+O232","v":95166749.127365351}]
[null,null,"Moy. annuelle",{"$f":"D232/DonnéesProjet!$B89","v":6604233.003315459},{"$f":"E232/DonnéesProjet!$B89","v":8102081.8269810257},{"$f":"E233+D233","v":14706314.830296485},null,"Moy. annuelle",{"$f":"I232/DonnéesProjet!$B96","v":0},{"$f":"J232/DonnéesProjet!$B96","v":0},{"$f":"I233+J233","v":0},null,"Moy. annuelle",{"$f":"N232/DonnéesProjet!$B96","v":2732816.9996230109},{"$f":"O232/DonnéesProjet!$B96","v":2025520.4567452564},{"$f":"N233+O233","v":4758337.4563682675}]

{"sheet":"Déflateurs","index":8,"n_rows":60,"n_cols":49,"rows_kept":60,"cut":false,"hidden":false,"merged":[[0,0,16,1]]}
["*** AVERTISSEMENT ***\n\nCette feuille de calcul contient des données et des formules qui font partie intégrante du modèle EI2. \nBien que ces données et formules soient consultables pour examen, elles ne doivent pas être modifiées.\nToute modification des données ou des formules affectera l'analyse et pourrait invalider les résultats du modèle.\n\nPour les visualiser, faites simplement défiler les colonnes vers la droite.",null,"Déflateurs / Inflateurs"]
[null,null,"Pour assurer la consistance entre les multiplicateurs et les données projet"]
[]
[null,null,"Année des multiplicateurs",null,{"$f":"IF(DonnéesProjet!B9=\"MARÉGION\",RégionPersonnalisée!D4,Multiplicateurs!C63)","v":2017},null,null,null,"Déflateur",{"$f":"HLOOKUP($E$5,D9:AW51,$D$60)","v":0.94890510948905105}]
[null,null,"Dollars de l'année",null,{"$f":"DonnéesProjet!B16","v":2020},null,null,null,"Inflateur",{"$f":"HLOOKUP($E$5,D9:AW51,$D$59)","v":1.0538461538461539}]
[]
[]
[]
[null,null,null,2005,2006,2007,2008,2009,2010,2011,2012,2013,2014,2015,2016,2017,2018,2019,2020,2021,2022,2023,2024,2025,2026,2027,2028,2029,2030,2031,2032,2033,2034,2035,2036,2037,2038,2039,2040,2041,2042,2043,2044,2045,2046,2047,2048,2049,2050]
[null,null,2005,1,1.0186915887850467,1.0467289719626169,1.0654205607476634,1.0654205607476634,1.0934579439252334,1.1214953271028036,1.1401869158878504,1.1495327102803738,1.1682242990654206,1.1869158878504673,1.1962616822429906,1.2149532710280373,1.2429906542056075,1.2710280373831775,1.280373831775701,1.2990654205607475,1.3271028037383177,1.3457943925233644,1.3738317757009344,1.3925233644859811,1.4205607476635513,1.4485981308411215,1.485981308411215,1.514018691588785,1.5514018691588782,1.5794392523364484,1.6168224299065419,1.6542056074766354,1.6822429906542056,1.719626168224299,1.7570093457943923,1.7943925233644857,1.8224299065420559,1.8598130841121494,1.8971962616822426,1.9345794392523361,1.9813084112149533,2.018691588785047,2.0560747663551404,2.1028037383177569,2.1495327102803734,2.1869158878504669,2.2336448598130842,2.2803738317757007,2.3364485981308412]
[null,null,null,1,0.98165137614678899,0.95535714285714279,0.93859649122807032,0.93859649122807032,0.91452991452991461,0.89166666666666672,0.87704918032786894,0.86991869918699194,0.85600000000000009,0.84251968503937014,0.8359375,0.82307692307692315,0.80451127819548873,0.78676470588235292,0.78102189781021891,0.7697841726618706,0.75352112676056349,0.74305555555555558,0.72789115646258506,0.71812080536912759,0.70394736842105265,0.69032258064516128,0.67295597484276726,0.66049382716049387,0.64457831325301207,0.63313609467455623,0.61849710982658967,0.60451977401129942,0.59444444444444444,0.58152173913043481,0.56914893617021278,0.55729166666666674,0.54871794871794877,0.53768844221105527,0.52709359605911343,0.51690821256038655,0.50471698113207553,0.49537037037037035,0.48636363636363633,0.47555555555555556,0.46521739130434792,0.45726495726495731,0.44769874476987448,0.43852459016393447,0.42800000000000005]
[null,null,2006,0.98165137614678899,1,1.0275229357798166,1.0458715596330272,1.0458715596330272,1.0733944954128438,1.1009174311926604,1.1192660550458715,1.128440366972477,1.1467889908256881,1.165137614678899,1.1743119266055044,1.1926605504587156,1.2201834862385321,1.2477064220183487,1.2568807339449541,1.275229357798165,1.3027522935779814,1.3211009174311925,1.3486238532110091,1.36697247706422,1.3944954128440366,1.4220183486238531,1.4587155963302751,1.4862385321100917,1.5229357798165135,1.5504587155963301,1.5871559633027521,1.6238532110091741,1.6513761467889907,1.6880733944954127,1.7247706422018347,1.7614678899082568,1.7889908256880733,1.8256880733944953,1.8623853211009171,1.8990825688073392,1.9449541284403669,1.9816513761467889,2.0183486238532109,2.0642201834862384,2.1100917431192658,2.1467889908256876,2.1926605504587156,2.238532110091743,2.2935779816513762]
[null,null,null,1.0186915887850467,1,0.9732142857142857,0.95614035087719318,0.95614035087719318,0.93162393162393176,0.90833333333333344,0.89344262295081978,0.88617886178861793,0.87200000000000011,0.8582677165354331,0.8515625,0.83846153846153848,0.81954887218045114,0.80147058823529416,0.79562043795620441,0.78417266187050372,0.76760563380281699,0.75694444444444453,0.74149659863945583,0.73154362416107388,0.7171052631578948,0.70322580645161292,0.68553459119496862,0.6728395061728395,0.65662650602409645,0.64497041420118351,0.63005780346820817,0.61581920903954801,0.60555555555555562,0.59239130434782605,0.57978723404255328,0.56770833333333337,0.55897435897435899,0.54773869346733672,0.53694581280788189,0.52657004830917886,0.51415094339622647,0.50462962962962965,0.49545454545454543,0.48444444444444446,0.47391304347826096,0.46581196581196588,0.45606694560669458,0.44672131147540989,0.43600000000000005]
[null,null,2007,0.95535714285714279,0.9732142857142857,1,1.0178571428571426,1.0178571428571426,1.044642857142857,1.0714285714285714,1.0892857142857142,1.0982142857142856,1.1160714285714284,1.1339285714285714,1.1428571428571428,1.1607142857142856,1.1875,1.2142857142857142,1.2232142857142856,1.2410714285714284,1.2678571428571426,1.2857142857142856,1.3124999999999998,1.3303571428571428,1.357142857142857,1.3839285714285714,1.419642857142857,1.4464285714285714,1.482142857142857,1.5089285714285712,1.544642857142857,1.5803571428571428,1.607142857142857,1.6428571428571428,1.6785714285714284,1.714285714285714,1.7410714285714284,1.7767857142857142,1.8124999999999996,1.8482142857142854,1.8928571428571428,1.9285714285714286,1.9642857142857142,2.0089285714285712,2.0535714285714284,2.089285714285714,2.1339285714285712,2.1785714285714284,2.2321428571428568]
[null,null,null,1.0467289719626169,1.0275229357798166,1,0.98245614035087736,0.98245614035087736,0.95726495726495742,0.93333333333333346,0.91803278688524603,0.91056910569105698,0.89600000000000013,0.88188976377952766,0.87500000000000011,0.86153846153846159,0.8421052631578948,0.82352941176470595,0.81751824817518248,0.80575539568345333,0.78873239436619724,0.7777777777777779,0.76190476190476197,0.75167785234899331,0.73684210526315796,0.72258064516129039,0.70440251572327051,0.6913580246913581,0.67469879518072295,0.66272189349112431,0.64739884393063596,0.63276836158192096,0.62222222222222223,0.60869565217391308,0.59574468085106391,0.58333333333333337,0.57435897435897443,0.5628140703517589,0.55172413793103459,0.54106280193236722,0.52830188679245282,0.51851851851851849,0.50909090909090915,0.49777777777777782,0.48695652173913051,0.47863247863247871,0.46861924686192469,0.45901639344262302,0.44800000000000006]
[null,null,2008,0.93859649122807032,0.95614035087719318,0.98245614035087736,1,1,1.0263157894736843,1.0526315789473684,1.0701754385964912,1.0789473684210527,1.0964912280701755,1.1140350877192984,1.1228070175438598,1.1403508771929827,1.1666666666666667,1.192982456140351,1.2017543859649125,1.2192982456140351,1.2456140350877194,1.2631578947368423,1.2894736842105263,1.3070175438596492,1.3333333333333335,1.3596491228070178,1.3947368421052633,1.4210526315789476,1.4561403508771931,1.4824561403508774,1.5175438596491229,1.5526315789473686,1.5789473684210529,1.6140350877192984,1.6491228070175439,1.6842105263157896,1.7105263157894739,1.7456140350877194,1.7807017543859649,1.8157894736842106,1.8596491228070178,1.8947368421052635,1.929824561403509,1.9736842105263159,2.0175438596491229,2.0526315789473686,2.0964912280701755,2.1403508771929824,2.192982456140351]
[null,null,null,1.0654205607476634,1.0458715596330272,1.0178571428571426,1,1,0.97435897435897434,0.95,0.93442622950819665,0.92682926829268286,0.91199999999999992,0.89763779527559051,0.89062499999999989,0.87692307692307681,0.85714285714285698,0.83823529411764697,0.83211678832116776,0.82014388489208634,0.80281690140845063,0.79166666666666663,0.77551020408163263,0.76510067114093949,0.74999999999999989,0.73548387096774182,0.71698113207547165,0.70370370370370361,0.68674698795180722,0.67455621301775148,0.65895953757225434,0.64406779661016944,0.6333333333333333,0.61956521739130421,0.60638297872340419,0.59375,0.58461538461538454,0.57286432160804013,0.56157635467980294,0.55072463768115942,0.53773584905660365,0.52777777777777768,0.51818181818181808,0.5066666666666666,0.49565217391304345,0.48717948717948717,0.47698744769874468,0.46721311475409832,0.45599999999999996]
[null,null,2009,0.93859649122807032,0.95614035087719318,0.98245614035087736,1,1,1.0263157894736843,1.0526315789473684,1.0701754385964912,1.0789473684210527,1.0964912280701755,1.1140350877192984,1.1228070175438598,1.1403508771929827,1.1666666666666667,1.192982456140351,1.2017543859649125,1.2192982456140351,1.2456140350877194,1.2631578947368423,1.2894736842105263,1.3070175438596492,1.3333333333333335,1.3596491228070178,1.3947368421052633,1.4210526315789476,1.4561403508771931,1.4824561403508774,1.5175438596491229,1.5526315789473686,1.5789473684210529,1.6140350877192984,1.6491228070175439,1.6842105263157896,1.7105263157894739,1.7456140350877194,1.7807017543859649,1.8157894736842106,1.8596491228070178,1.8947368421052635,1.929824561403509,1.9736842105263159,2.0175438596491229,2.0526315789473686,2.0964912280701755,2.1403508771929824,2.192982456140351]
[null,null,null,1.0654205607476634,1.0458715596330272,1.0178571428571426,1,1,0.97435897435897434,0.95,0.93442622950819665,0.92682926829268286,0.91199999999999992,0.89763779527559051,0.89062499999999989,0.87692307692307681,0.85714285714285698,0.83823529411764697,0.83211678832116776,0.82014388489208634,0.80281690140845063,0.79166666666666663,0.77551020408163263,0.76510067114093949,0.74999999999999989,0.73548387096774182,0.71698113207547165,0.70370370370370361,0.68674698795180722,0.67455621301775148,0.65895953757225434,0.64406779661016944,0.6333333333333333,0.61956521739130421,0.60638297872340419,0.59375,0.58461538461538454,0.57286432160804013,0.56157635467980294,0.55072463768115942,0.53773584905660365,0.52777777777777768,0.51818181818181808,0.5066666666666666,0.49565217391304345,0.48717948717948717,0.47698744769874468,0.46721311475409832,0.45599999999999996]
[null,null,2010,0.91452991452991461,0.93162393162393176,0.95726495726495742,0.97435897435897434,0.97435897435897434,1,1.0256410256410258,1.0427350427350428,1.0512820512820513,1.0683760683760684,1.0854700854700856,1.0940170940170941,1.1111111111111112,1.1367521367521369,1.1623931623931625,1.170940170940171,1.188034188034188,1.2136752136752136,1.2307692307692308,1.2564102564102564,1.2735042735042736,1.2991452991452992,1.324786324786325,1.358974358974359,1.3846153846153848,1.4188034188034189,1.4444444444444444,1.4786324786324787,1.512820512820513,1.5384615384615385,1.5726495726495728,1.6068376068376069,1.641025641025641,1.6666666666666667,1.700854700854701,1.7350427350427349,1.7692307692307692,1.8119658119658122,1.8461538461538465,1.8803418803418805,1.9230769230769231,1.9658119658119657,2,2.042735042735043,2.0854700854700856,2.1367521367521367]
[null,null,null,1.0934579439252334,1.0733944954128438,1.044642857142857,1.0263157894736843,1.0263157894736843,1,0.97499999999999998,0.95901639344262291,0.95121951219512191,0.93599999999999994,0.92125984251968496,0.91406249999999989,0.89999999999999991,0.87969924812030065,0.86029411764705876,0.85401459854014583,0.84172661870503596,0.823943661971831,0.8125,0.79591836734693877,0.78523489932885904,0.76973684210526305,0.75483870967741928,0.73584905660377353,0.7222222222222221,0.70481927710843373,0.69230769230769229,0.67630057803468202,0.66101694915254228,0.64999999999999991,0.63586956521739124,0.62234042553191493,0.609375,0.6,0.5879396984924623,0.57635467980295574,0.56521739130434778,0.55188679245283012,0.54166666666666663,0.53181818181818175,0.52,0.5086956521739131,0.5,0.48953974895397484,0.47950819672131145,0.46799999999999997]
[null,null,2011,0.89166666666666672,0.90833333333333344,0.93333333333333346,0.95,0.95,0.97499999999999998,1,1.0166666666666666,1.0250000000000001,1.0416666666666667,1.0583333333333333,1.0666666666666667,1.0833333333333335,1.1083333333333334,1.1333333333333335,1.1416666666666668,1.1583333333333332,1.1833333333333333,1.2,1.2250000000000001,1.2416666666666667,1.2666666666666668,1.2916666666666667,1.3250000000000002,1.35,1.3833333333333333,1.4083333333333334,1.4416666666666667,1.4750000000000001,1.5,1.5333333333333334,1.5666666666666667,1.6,1.625,1.6583333333333334,1.6916666666666667,1.7249999999999999,1.7666666666666668,1.8000000000000003,1.8333333333333335,1.875,1.9166666666666665,1.95,1.9916666666666669,2.0333333333333332,2.0833333333333335]
[null,null,null,1.1214953271028036,1.1009174311926604,1.0714285714285714,1.0526315789473684,1.0526315789473684,1.0256410256410258,1,0.98360655737704916,0.97560975609756095,0.96,0.94488188976377951,0.9375,0.92307692307692302,0.90225563909774431,0.88235294117647045,0.87591240875912402,0.86330935251798568,0.84507042253521125,0.83333333333333337,0.81632653061224492,0.80536912751677847,0.78947368421052633,0.77419354838709675,0.75471698113207542,0.7407407407407407,0.72289156626506024,0.7100591715976331,0.69364161849710981,0.67796610169491522,0.66666666666666663,0.65217391304347816,0.63829787234042556,0.625,0.61538461538461542,0.60301507537688437,0.59113300492610843,0.57971014492753625,0.56603773584905659,0.55555555555555547,0.54545454545454541,0.53333333333333333,0.52173913043478259,0.51282051282051289,0.502092050209205,0.49180327868852458,0.48]
[null,null,2012,0.87704918032786894,0.89344262295081978,0.91803278688524603,0.93442622950819665,0.93442622950819665,0.95901639344262291,0.98360655737704916,1,1.0081967213114753,1.0245901639344261,1.040983606557377,1.0491803278688525,1.0655737704918034,1.0901639344262295,1.1147540983606559,1.1229508196721312,1.139344262295082,1.1639344262295082,1.180327868852459,1.2049180327868851,1.221311475409836,1.2459016393442623,1.2704918032786885,1.3032786885245902,1.3278688524590165,1.360655737704918,1.3852459016393444,1.4180327868852458,1.4508196721311475,1.4754098360655739,1.5081967213114755,1.540983606557377,1.5737704918032787,1.598360655737705,1.6311475409836065,1.6639344262295082,1.6967213114754098,1.737704918032787,1.7704918032786887,1.8032786885245904,1.8442622950819672,1.8852459016393441,1.9180327868852458,1.959016393442623,2,2.0491803278688523]
[null,null,null,1.1401869158878504,1.1192660550458715,1.0892857142857142,1.0701754385964912,1.0701754385964912,1.0427350427350428,1.0166666666666666,1,0.99186991869918695,0.97599999999999998,0.96062992125984248,0.953125,0.93846153846153846,0.91729323308270672,0.89705882352941169,0.8905109489051094,0.8776978417266188,0.85915492957746487,0.84722222222222221,0.82993197278911568,0.81879194630872487,0.80263157894736836,0.7870967741935484,0.76729559748427667,0.75308641975308632,0.73493975903614461,0.72189349112426038,0.7052023121387283,0.68926553672316382,0.6777777777777777,0.66304347826086951,0.64893617021276595,0.63541666666666663,0.62564102564102564,0.61306532663316582,0.60098522167487689,0.58937198067632857,0.57547169811320753,0.56481481481481477,0.55454545454545445,0.54222222222222216,0.5304347826086957,0.5213675213675214,0.5104602510460251,0.5,0.48799999999999999]
[null,null,2013,0.86991869918699194,0.88617886178861793,0.91056910569105698,0.92682926829268286,0.92682926829268286,0.95121951219512191,0.97560975609756095,0.99186991869918695,1,1.0162601626016261,1.032520325203252,1.0406504065040652,1.056910569105691,1.0813008130081301,1.1056910569105691,1.1138211382113823,1.1300813008130082,1.1544715447154472,1.1707317073170731,1.1951219512195121,1.2113821138211383,1.2357723577235773,1.2601626016260163,1.2926829268292683,1.3170731707317074,1.3495934959349594,1.3739837398373984,1.4065040650406504,1.4390243902439024,1.4634146341463414,1.4959349593495936,1.5284552845528454,1.5609756097560976,1.5853658536585367,1.6178861788617886,1.6504065040650404,1.6829268292682926,1.7235772357723578,1.75609756097561,1.788617886178862,1.8292682926829269,1.8699186991869918,1.9024390243902438,1.943089430894309,1.9837398373983739,2.0325203252032522]
[null,null,null,1.1495327102803738,1.128440366972477,1.0982142857142856,1.0789473684210527,1.0789473684210527,1.0512820512820513,1.0250000000000001,1.0081967213114753,1,0.98399999999999999,0.96850393700787396,0.9609375,0.94615384615384612,0.92481203007518786,0.90441176470588225,0.89781021897810209,0.8848920863309353,0.86619718309859162,0.85416666666666674,0.83673469387755106,0.82550335570469802,0.80921052631578949,0.79354838709677411,0.7735849056603773,0.75925925925925919,0.74096385542168675,0.72781065088757402,0.71098265895953761,0.69491525423728817,0.68333333333333335,0.66847826086956519,0.6542553191489362,0.640625,0.63076923076923075,0.61809045226130654,0.60591133004926112,0.59420289855072472,0.58018867924528295,0.56944444444444442,0.55909090909090908,0.54666666666666663,0.5347826086956522,0.52564102564102566,0.5146443514644351,0.50409836065573765,0.49199999999999999]
[null,null,2014,0.85600000000000009,0.87200000000000011,0.89600000000000013,0.91199999999999992,0.91199999999999992,0.93599999999999994,0.96,0.97599999999999998,0.98399999999999999,1,1.016,1.024,1.04,1.0640000000000001,1.0880000000000001,1.0960000000000001,1.1119999999999999,1.1359999999999999,1.1519999999999999,1.1759999999999999,1.1919999999999999,1.216,1.24,1.272,1.296,1.3279999999999998,1.3519999999999999,1.3839999999999999,1.4159999999999999,1.44,1.472,1.504,1.536,1.56,1.5920000000000001,1.6239999999999999,1.6559999999999999,1.6960000000000002,1.7280000000000002,1.7600000000000002,1.8,1.8399999999999999,1.8719999999999999,1.9120000000000001,1.952,2]
[null,null,null,1.1682242990654206,1.1467889908256881,1.1160714285714284,1.0964912280701755,1.0964912280701755,1.0683760683760684,1.0416666666666667,1.0245901639344261,1.0162601626016261,1,0.98425196850393704,0.9765625,0.96153846153846145,0.93984962406015038,0.91911764705882348,0.91240875912408748,0.89928057553956842,0.88028169014084512,0.86805555555555558,0.85034013605442182,0.83892617449664431,0.82236842105263153,0.80645161290322576,0.78616352201257855,0.77160493827160492,0.75301204819277112,0.73964497041420119,0.7225433526011561,0.70621468926553677,0.69444444444444442,0.67934782608695654,0.66489361702127658,0.65104166666666674,0.64102564102564108,0.62814070351758799,0.61576354679802958,0.60386473429951693,0.58962264150943389,0.57870370370370372,0.56818181818181812,0.55555555555555558,0.5434782608695653,0.53418803418803418,0.52301255230125521,0.51229508196721307,0.5]
[null,null,2015,0.84251968503937014,0.8582677165354331,0.88188976377952766,0.89763779527559051,0.89763779527559051,0.92125984251968496,0.94488188976377951,0.96062992125984248,0.96850393700787396,0.98425196850393704,1,1.0078740157480315,1.0236220472440944,1.0472440944881891,1.0708661417322836,1.078740157480315,1.0944881889763778,1.1181102362204725,1.1338582677165354,1.1574803149606299,1.1732283464566928,1.1968503937007875,1.2204724409448819,1.2519685039370079,1.2755905511811025,1.3070866141732282,1.3307086614173227,1.3622047244094488,1.3937007874015748,1.4173228346456692,1.4488188976377954,1.4803149606299211,1.5118110236220472,1.5354330708661417,1.5669291338582676,1.5984251968503935,1.6299212598425195,1.6692913385826773,1.7007874015748032,1.7322834645669292,1.7716535433070866,1.811023622047244,1.8425196850393699,1.8818897637795275,1.921259842519685,1.9685039370078741]
[null,null,null,1.1869158878504673,1.165137614678899,1.1339285714285714,1.1140350877192984,1.1140350877192984,1.0854700854700856,1.0583333333333333,1.040983606557377,1.032520325203252,1.016,1,0.9921875,0.97692307692307689,0.95488721804511278,0.93382352941176461,0.92700729927007297,0.91366906474820153,0.89436619718309862,0.88194444444444453,0.86394557823129259,0.8523489932885906,0.83552631578947367,0.8193548387096774,0.79874213836477981,0.78395061728395055,0.7650602409638555,0.75147928994082847,0.73410404624277459,0.71751412429378536,0.7055555555555556,0.69021739130434778,0.67553191489361708,0.66145833333333337,0.6512820512820513,0.63819095477386933,0.62561576354679815,0.61352657004830924,0.59905660377358494,0.58796296296296291,0.57727272727272727,0.56444444444444442,0.55217391304347829,0.54273504273504281,0.53138075313807531,0.52049180327868849,0.50800000000000001]
[null,null,2016,0.8359375,0.8515625,0.87500000000000011,0.89062499999999989,0.89062499999999989,0.91406249999999989,0.9375,0.953125,0.9609375,0.9765625,0.9921875,1,1.015625,1.0390625,1.0625,1.0703125,1.0859375,1.109375,1.125,1.1484375,1.1640625,1.1875,1.2109375,1.2421875,1.265625,1.296875,1.3203125,1.3515625,1.3828125,1.40625,1.4375,1.4687499999999998,1.5,1.5234375,1.5546875,1.5859374999999998,1.6171874999999998,1.65625,1.6875,1.71875,1.7578125,1.7968749999999998,1.8281249999999998,1.8671875,1.90625,1.953125]
[null,null,null,1.1962616822429906,1.1743119266055044,1.1428571428571428,1.1228070175438598,1.1228070175438598,1.0940170940170941,1.0666666666666667,1.0491803278688525,1.0406504065040652,1.024,1.0078740157480315,1,0.98461538461538456,0.96240601503759393,0.94117647058823528,0.93430656934306566,0.92086330935251803,0.90140845070422537,0.88888888888888895,0.87074829931972797,0.85906040268456374,0.84210526315789469,0.82580645161290323,0.80503144654088044,0.79012345679012341,0.77108433734939763,0.75739644970414211,0.73988439306358389,0.7231638418079096,0.71111111111111114,0.69565217391304346,0.68085106382978733,0.66666666666666674,0.65641025641025641,0.64321608040201006,0.63054187192118238,0.6183574879227054,0.60377358490566035,0.59259259259259256,0.58181818181818179,0.56888888888888889,0.55652173913043479,0.54700854700854706,0.53556485355648531,0.52459016393442626,0.51200000000000001]
[null,null,2017,0.82307692307692315,0.83846153846153848,0.86153846153846159,0.87692307692307681,0.87692307692307681,0.89999999999999991,0.92307692307692302,0.93846153846153846,0.94615384615384612,0.96153846153846145,0.97692307692307689,0.98461538461538456,1,1.023076923076923,1.0461538461538462,1.0538461538461539,1.0692307692307692,1.0923076923076922,1.1076923076923075,1.1307692307692307,1.1461538461538461,1.1692307692307693,1.1923076923076923,1.2230769230769232,1.2461538461538462,1.2769230769230768,1.2999999999999998,1.3307692307692307,1.3615384615384616,1.3846153846153846,1.4153846153846155,1.4461538461538461,1.4769230769230768,1.5,1.5307692307692307,1.5615384615384613,1.5923076923076922,1.6307692307692307,1.6615384615384616,1.6923076923076923,1.7307692307692306,1.7692307692307689,1.7999999999999998,1.8384615384615386,1.8769230769230769,1.9230769230769229]
[null,null,null,1.2149532710280373,1.1926605504587156,1.1607142857142856,1.1403508771929827,1.1403508771929827,1.1111111111111112,1.0833333333333335,1.0655737704918034,1.056910569105691,1.04,1.0236220472440944,1.015625,1,0.97744360902255634,0.95588235294117641,0.94890510948905105,0.93525179856115115,0.91549295774647899,0.90277777777777779,0.88435374149659873,0.87248322147651014,0.85526315789473684,0.83870967741935487,0.8176100628930818,0.80246913580246915,0.78313253012048201,0.76923076923076927,0.75144508670520238,0.7344632768361582,0.72222222222222221,0.70652173913043481,0.69148936170212771,0.67708333333333337,0.66666666666666674,0.65326633165829151,0.64039408866995085,0.62801932367149771,0.6132075471698113,0.60185185185185186,0.59090909090909083,0.57777777777777783,0.56521739130434789,0.55555555555555558,0.54393305439330542,0.53278688524590168,0.52]
[null,null,2018,0.80451127819548873,0.81954887218045114,0.8421052631578948,0.85714285714285698,0.85714285714285698,0.87969924812030065,0.90225563909774431,0.91729323308270672,0.92481203007518786,0.93984962406015038,0.95488721804511278,0.96240601503759393,0.97744360902255634,1,1.0225563909774436,1.0300751879699248,1.0451127819548871,1.0676691729323307,1.0827067669172932,1.1052631578947367,1.1203007518796992,1.1428571428571428,1.1654135338345863,1.1954887218045114,1.2180451127819549,1.2481203007518795,1.2706766917293233,1.3007518796992481,1.3308270676691729,1.3533834586466165,1.3834586466165413,1.4135338345864661,1.4436090225563909,1.4661654135338344,1.4962406015037593,1.5263157894736841,1.5563909774436089,1.5939849624060149,1.6240601503759398,1.6541353383458648,1.6917293233082706,1.7293233082706765,1.7593984962406013,1.7969924812030076,1.8345864661654134,1.8796992481203008]
[null,null,null,1.2429906542056075,1.2201834862385321,1.1875,1.1666666666666667,1.1666666666666667,1.1367521367521369,1.1083333333333334,1.0901639344262295,1.0813008130081301,1.0640000000000001,1.0472440944881891,1.0390625,1.023076923076923,1,0.9779411764705882,0.97080291970802912,0.95683453237410088,0.93661971830985924,0.92361111111111116,0.90476190476190488,0.89261744966442957,0.875,0.85806451612903223,0.83647798742138368,0.82098765432098764,0.80120481927710852,0.78698224852071008,0.76878612716763006,0.75141242937853114,0.73888888888888893,0.72282608695652173,0.70744680851063835,0.69270833333333337,0.68205128205128207,0.66834170854271358,0.65517241379310354,0.64251207729468607,0.62735849056603776,0.6157407407407407,0.6045454545454545,0.59111111111111114,0.57826086956521749,0.56837606837606847,0.55648535564853552,0.54508196721311475,0.53200000000000003]
[null,null,2019,0.78676470588235292,0.80147058823529416,0.82352941176470595,0.83823529411764697,0.83823529411764697,0.86029411764705876,0.88235294117647045,0.89705882352941169,0.90441176470588225,0.91911764705882348,0.93382352941176461,0.94117647058823528,0.95588235294117641,0.9779411764705882,1,1.0073529411764706,1.0220588235294117,1.0441176470588234,1.0588235294117645,1.0808823529411764,1.0955882352941175,1.1176470588235294,1.1397058823529411,1.1691176470588236,1.1911764705882353,1.2205882352941175,1.2426470588235292,1.2720588235294117,1.3014705882352939,1.3235294117647058,1.3529411764705881,1.3823529411764703,1.4117647058823528,1.4338235294117645,1.463235294117647,1.4926470588235292,1.5220588235294115,1.5588235294117647,1.588235294117647,1.6176470588235294,1.6544117647058822,1.6911764705882351,1.7205882352941175,1.7573529411764706,1.7941176470588234,1.838235294117647]
[null,null,null,1.2710280373831775,1.2477064220183487,1.2142857142857142,1.192982456140351,1.192982456140351,1.1623931623931625,1.1333333333333335,1.1147540983606559,1.1056910569105691,1.0880000000000001,1.0708661417322836,1.0625,1.0461538461538462,1.0225563909774436,1,0.99270072992700731,0.97841726618705049,0.9577464788732396,0.94444444444444453,0.92517006802721091,0.91275167785234912,0.89473684210526316,0.8774193548387097,0.85534591194968557,0.83950617283950613,0.81927710843373502,0.804733727810651,0.78612716763005785,0.76836158192090398,0.75555555555555554,0.73913043478260876,0.72340425531914898,0.70833333333333337,0.69743589743589751,0.68341708542713575,0.66995073891625623,0.65700483091787454,0.64150943396226412,0.62962962962962965,0.61818181818181817,0.60444444444444445,0.5913043478260871,0.58119658119658124,0.56903765690376573,0.55737704918032793,0.54400000000000004]
[null,null,2020,0.78102189781021891,0.79562043795620441,0.81751824817518248,0.83211678832116776,0.83211678832116776,0.85401459854014583,0.87591240875912402,0.8905109489051094,0.89781021897810209,0.91240875912408748,0.92700729927007297,0.93430656934306566,0.94890510948905105,0.97080291970802912,0.99270072992700731,1,1.0145985401459852,1.0364963503649633,1.0510948905109487,1.0729927007299269,1.0875912408759123,1.1094890510948905,1.1313868613138685,1.1605839416058394,1.1824817518248174,1.2116788321167882,1.2335766423357664,1.2627737226277371,1.2919708029197079,1.3138686131386861,1.3430656934306568,1.3722627737226276,1.4014598540145984,1.4233576642335766,1.4525547445255473,1.4817518248175179,1.5109489051094889,1.5474452554744524,1.5766423357664234,1.6058394160583942,1.6423357664233575,1.6788321167883209,1.7080291970802917,1.7445255474452555,1.7810218978102188,1.824817518248175]
[null,null,null,1.280373831775701,1.2568807339449541,1.2232142857142856,1.2017543859649125,1.2017543859649125,1.170940170940171,1.1416666666666668,1.1229508196721312,1.1138211382113823,1.0960000000000001,1.078740157480315,1.0703125,1.0538461538461539,1.0300751879699248,1.0073529411764706,1,0.98561151079136711,0.96478873239436636,0.95138888888888895,0.93197278911564629,0.91946308724832226,0.90131578947368429,0.88387096774193552,0.86163522012578619,0.84567901234567899,0.82530120481927727,0.81065088757396464,0.79190751445086716,0.77401129943502833,0.76111111111111118,0.74456521739130432,0.72872340425531923,0.71354166666666674,0.70256410256410262,0.68844221105527648,0.67487684729064046,0.66183574879227058,0.64622641509433965,0.6342592592592593,0.62272727272727268,0.60888888888888892,0.59565217391304359,0.5854700854700855,0.57322175732217573,0.56147540983606559,0.54800000000000004]
[null,null,2021,0.7697841726618706,0.78417266187050372,0.80575539568345333,0.82014388489208634,0.82014388489208634,0.84172661870503596,0.86330935251798568,0.8776978417266188,0.8848920863309353,0.89928057553956842,0.91366906474820153,0.92086330935251803,0.93525179856115115,0.95683453237410088,0.97841726618705049,0.98561151079136711,1,1.0215827338129497,1.0359712230215827,1.0575539568345325,1.0719424460431655,1.0935251798561152,1.1151079136690649,1.1438848920863312,1.1654676258992807,1.1942446043165469,1.2158273381294964,1.2446043165467626,1.2733812949640289,1.2949640287769786,1.3237410071942448,1.3525179856115108,1.3812949640287771,1.4028776978417268,1.431654676258993,1.460431654676259,1.4892086330935252,1.5251798561151082,1.5539568345323742,1.5827338129496404,1.6187050359712232,1.6546762589928057,1.6834532374100719,1.7194244604316549,1.7553956834532376,1.7985611510791368]
[null,null,null,1.2990654205607475,1.275229357798165,1.2410714285714284,1.2192982456140351,1.2192982456140351,1.188034188034188,1.1583333333333332,1.139344262295082,1.1300813008130082,1.1119999999999999,1.0944881889763778,1.0859375,1.0692307692307692,1.0451127819548871,1.0220588235294117,1.0145985401459852,1,0.97887323943661975,0.96527777777777779,0.94557823129251695,0.93288590604026844,0.91447368421052622,0.89677419354838706,0.87421383647798734,0.85802469135802462,0.83734939759036142,0.8224852071005917,0.80346820809248554,0.78531073446327682,0.77222222222222214,0.75543478260869557,0.73936170212765961,0.72395833333333326,0.71282051282051284,0.6984924623115577,0.68472906403940892,0.67149758454106279,0.65566037735849048,0.64351851851851838,0.63181818181818172,0.61777777777777776,0.60434782608695647,0.59401709401709402,0.58158995815899572,0.56967213114754101,0.55599999999999994]
[null,null,2022,0.75352112676056349,0.76760563380281699,0.78873239436619724,0.80281690140845063,0.80281690140845063,0.823943661971831,0.84507042253521125,0.85915492957746487,0.86619718309859162,0.88028169014084512,0.89436619718309862,0.90140845070422537,0.91549295774647899,0.93661971830985924,0.9577464788732396,0.96478873239436636,0.97887323943661975,1,1.0140845070422535,1.0352112676056338,1.0492957746478875,1.0704225352112677,1.091549295774648,1.119718309859155,1.1408450704225352,1.1690140845070423,1.1901408450704225,1.2183098591549297,1.2464788732394367,1.267605633802817,1.295774647887324,1.323943661971831,1.352112676056338,1.3732394366197183,1.4014084507042255,1.4295774647887323,1.4577464788732395,1.4929577464788735,1.5211267605633805,1.5492957746478875,1.5845070422535212,1.619718309859155,1.647887323943662,1.683098591549296,1.7183098591549297,1.7605633802816902]
[null,null,null,1.3271028037383177,1.3027522935779814,1.2678571428571426,1.2456140350877194,1.2456140350877194,1.2136752136752136,1.1833333333333333,1.1639344262295082,1.1544715447154472,1.1359999999999999,1.1181102362204725,1.109375,1.0923076923076922,1.0676691729323307,1.0441176470588234,1.0364963503649633,1.0215827338129497,1,0.98611111111111105,0.96598639455782309,0.95302013422818788,0.93421052631578938,0.91612903225806441,0.89308176100628922,0.87654320987654311,0.85542168674698793,0.84023668639053251,0.82080924855491322,0.80225988700564965,0.78888888888888886,0.77173913043478248,0.75531914893617025,0.73958333333333337,0.72820512820512817,0.71356783919597988,0.69950738916256161,0.68599033816425126,0.66981132075471694,0.65740740740740733,0.64545454545454539,0.63111111111111107,0.61739130434782608,0.60683760683760679,0.59414225941422583,0.58196721311475408,0.56799999999999995]
[null,null,2023,0.74305555555555558,0.75694444444444453,0.7777777777777779,0.79166666666666663,0.79166666666666663,0.8125,0.83333333333333337,0.84722222222222221,0.85416666666666674,0.86805555555555558,0.88194444444444453,0.88888888888888895,0.90277777777777779,0.92361111111111116,0.94444444444444453,0.95138888888888895,0.96527777777777779,0.98611111111111105,1,1.0208333333333333,1.0347222222222223,1.0555555555555556,1.0763888888888891,1.1041666666666667,1.1250000000000002,1.1527777777777777,1.1736111111111112,1.2013888888888888,1.2291666666666667,1.25,1.2777777777777779,1.3055555555555556,1.3333333333333333,1.3541666666666667,1.3819444444444444,1.4097222222222221,1.4375,1.4722222222222223,1.5000000000000002,1.5277777777777779,1.5625,1.5972222222222221,1.625,1.6597222222222223,1.6944444444444444,1.7361111111111112]
[null,null,null,1.3457943925233644,1.3211009174311925,1.2857142857142856,1.2631578947368423,1.2631578947368423,1.2307692307692308,1.2,1.180327868852459,1.1707317073170731,1.1519999999999999,1.1338582677165354,1.125,1.1076923076923075,1.0827067669172932,1.0588235294117645,1.0510948905109487,1.0359712230215827,1.0140845070422535,1,0.97959183673469385,0.96644295302013417,0.94736842105263153,0.92903225806451606,0.90566037735849048,0.88888888888888884,0.86746987951807231,0.85207100591715978,0.83236994219653182,0.81355932203389825,0.79999999999999993,0.78260869565217384,0.76595744680851063,0.75,0.7384615384615385,0.72361809045226133,0.70935960591133007,0.69565217391304346,0.67924528301886788,0.66666666666666663,0.65454545454545443,0.64,0.62608695652173918,0.61538461538461542,0.60251046025104593,0.5901639344262295,0.57599999999999996]
[null,null,2024,0.72789115646258506,0.74149659863945583,0.76190476190476197,0.77551020408163263,0.77551020408163263,0.79591836734693877,0.81632653061224492,0.82993197278911568,0.83673469387755106,0.85034013605442182,0.86394557823129259,0.87074829931972797,0.88435374149659873,0.90476190476190488,0.92517006802721091,0.93197278911564629,0.94557823129251695,0.96598639455782309,0.97959183673469385,1,1.0136054421768708,1.0340136054421769,1.0544217687074831,1.0816326530612246,1.1020408163265307,1.129251700680272,1.1496598639455782,1.1768707482993197,1.2040816326530612,1.2244897959183674,1.2517006802721089,1.2789115646258502,1.3061224489795917,1.3265306122448979,1.3537414965986394,1.3809523809523809,1.4081632653061225,1.4421768707482994,1.4693877551020409,1.4965986394557824,1.5306122448979591,1.564625850340136,1.5918367346938775,1.6258503401360545,1.6598639455782314,1.7006802721088436]
[null,null,null,1.3738317757009344,1.3486238532110091,1.3124999999999998,1.2894736842105263,1.2894736842105263,1.2564102564102564,1.2250000000000001,1.2049180327868851,1.1951219512195121,1.1759999999999999,1.1574803149606299,1.1484375,1.1307692307692307,1.1052631578947367,1.0808823529411764,1.0729927007299269,1.0575539568345325,1.0352112676056338,1.0208333333333333,1,0.98657718120805371,0.96710526315789469,0.94838709677419353,0.92452830188679236,0.90740740740740733,0.88554216867469882,0.86982248520710059,0.8497109826589595,0.83050847457627119,0.81666666666666665,0.79891304347826086,0.78191489361702127,0.765625,0.75384615384615383,0.7386934673366834,0.72413793103448276,0.71014492753623193,0.69339622641509424,0.68055555555555547,0.6681818181818181,0.65333333333333332,0.63913043478260878,0.62820512820512819,0.61506276150627615,0.60245901639344257,0.58799999999999997]
[null,null,2025,0.71812080536912759,0.73154362416107388,0.75167785234899331,0.76510067114093949,0.76510067114093949,0.78523489932885904,0.80536912751677847,0.81879194630872487,0.82550335570469802,0.83892617449664431,0.8523489932885906,0.85906040268456374,0.87248322147651014,0.89261744966442957,0.91275167785234912,0.91946308724832226,0.93288590604026844,0.95302013422818788,0.96644295302013417,0.98657718120805371,1,1.0201342281879195,1.0402684563758389,1.0671140939597317,1.087248322147651,1.1140939597315436,1.1342281879194631,1.1610738255033557,1.1879194630872483,1.2080536912751678,1.2348993288590604,1.261744966442953,1.2885906040268456,1.3087248322147651,1.3355704697986577,1.3624161073825503,1.3892617449664428,1.4228187919463089,1.4496644295302015,1.476510067114094,1.5100671140939597,1.5436241610738255,1.5704697986577181,1.6040268456375839,1.6375838926174497,1.6778523489932886]
[null,null,null,1.3925233644859811,1.36697247706422,1.3303571428571428,1.3070175438596492,1.3070175438596492,1.2735042735042736,1.2416666666666667,1.221311475409836,1.2113821138211383,1.1919999999999999,1.1732283464566928,1.1640625,1.1461538461538461,1.1203007518796992,1.0955882352941175,1.0875912408759123,1.0719424460431655,1.0492957746478875,1.0347222222222223,1.0136054421768708,1,0.98026315789473684,0.96129032258064517,0.93710691823899361,0.91975308641975306,0.89759036144578319,0.88165680473372787,0.86127167630057799,0.84180790960451979,0.82777777777777772,0.80978260869565211,0.79255319148936176,0.77604166666666674,0.76410256410256416,0.74874371859296485,0.73399014778325133,0.71980676328502424,0.70283018867924529,0.68981481481481477,0.67727272727272725,0.66222222222222227,0.64782608695652177,0.63675213675213682,0.62343096234309625,0.61065573770491799,0.59599999999999997]
[]
[]
[null,null,"Source : Régie de l’énergie du Canada. Avenir énergétique du Canada données des annexes.\n"]
[null,null,"DOI:","https://doi.org/10.35002/zjr8-8x75"]
[null,null,"(CPI)"]
[]
[null,null,null,null,2005,2006,2007,2008,2009,2010,2011,2012,2013,2014,2015,2016,2017,2018,2019,2020,2021,2022,2023,2024,2025]
[null,null,"Inf. ligne",{"$f":"HLOOKUP($E$4,E58:Y60,2)","v":26},2,4,6,8,10,12,14,16,18,20,22,24,26,28,30,32,34,36,38,40,42]
[null,null,"Def. ligne",{"$f":"HLOOKUP($E$4,E58:Y60,3)","v":27},3,5,7,9,11,13,15,17,19,21,23,25,27,29,31,33,35,37,39,41,43]

{"sheet":"Multiplicateurs","index":9,"n_rows":348,"n_cols":26,"rows_kept":348,"cut":false,"hidden":false,"merged":[[0,0,16,1]]}
["*** AVERTISSEMENT ***\n\nCette feuille de calcul contient des données et des formules qui font partie intégrante du modèle EI2. \nBien que ces données et formules soient consultables pour examen, elles ne doivent pas être modifiées.\nToute modification des données ou des formules affectera l'analyse et pourrait invalider les résultats du modèle.\n\nPour les visualiser, faites simplement défiler les colonnes vers la droite.",null,{"$f":"DonnéesProjet!B9","v":"Alberta"}]
[]
[]
[]
[null,null,"Multiplicateurs"]
[null,null,null,"Emplois",null,null,"Revenus d'emploi",null,null,"Extrant",null,null,"Valeur ajoutée"]
[null,null,null,"Direct","Indirect","Induit","Direct","Indirect","Induit","Direct","Indirect","Induit","Direct","Indirect","Induit",null,null,null,null,"Facteurs salaires","Impôts sur le revenu",null,null,"CPP + EI",6.83E-2]
[null,null,"Agriculture",{"$f":"IF(C1=D44,M_CA,IF(C1=E44,M_AB,IF(C1=F44,M_BC,IF(C1=G44,M_MB,IF(C1=H44,M_NB,IF(C1=I44,M_NL,IF(C1=J44,M_NT,IF(C1=K44,M_NS,IF(C1=L44,M_NU,IF(C1=M44,M_ON,IF(C1=N44,M_PE,IF(C1=O44,M_QC,IF(C1=P44,M_SK,IF(C1=Q44,M_YK,IF(C1=R44,M_MR,M_0)))))))))))))))","v":2.2940527386729013},1.9750425956620221,0.51593913894350463,7.3079135790848945E-2,0.11875997599486887,2.6173647953961796E-2,1,0.58751951493484034,0.10204619543906382,0.46211098090700664,0.2596545939896881,6.3120526123851203E-2,null,null,null,"Canada",1,0.16,null,null,"QPP + EI",7.4800000000000005E-2,"Québec"]
[null,null,"Exploitation minière",0.71394416125850468,1.6609846845741649,0.80523819342035574,0.13324700193082645,0.13721989990211844,4.0238380504414424E-2,1,0.4175383696517434,0.15862860272277921,0.54165475734401591,0.23363132532224554,9.8136950424575098E-2,null,null,null,"Alberta",1.0979511095684147,0.27]
[null,null,"Construction",3.4865808507104501,2.0789526318639258,1.3563346242124157,0.29457007747499669,0.16104352236118666,6.757569946374041E-2,1,0.49737581426511562,0.26628433052620709,0.41023870108301225,0.27109394040776225,0.16546476799882354,null,null,null,"Colombie-Britannique",0.98469163777502611,0.22]
[null,null,"Secteur manufacturier",1.4171204407640987,2.2126674869579377,0.74582759043794045,0.11543200808032471,0.14753294103156853,3.7133396399076361E-2,1,0.81731696435816992,0.1467888261577345,0.32217221938442731,0.35689916349596379,9.1169279531665662E-2,null,null,null,"Manitoba",0.92558204083678219,0.28000000000000003]
[null,null,"Fabrication de produits métalliques",3.0012062854899413,1.5862975213782731,1.1387536164644152,0.260398549196458,0.12035720328362244,5.7030263938031782E-2,1,0.3965963328014972,0.22369522460401686,0.35863469672795328,0.19806052787606354,0.13886274427102432,null,null,null,"Nouveau-Brunswick",0.7639823930037537,0.26]
[null,null,"Machinerie",2.792758336694865,1.5362496681371101,1.1152944426318436,0.24867423266194844,0.11889068760137504,5.591328700111884E-2,1,0.37831396483596302,0.21918068711178124,0.39326138922123544,0.19557394510766968,0.13590358570239164,null,null,null,"Terre-Neuve-et-Labrador",0.92521021299602779,0.28000000000000003]
[null,null,"Équipements électriques",2.6118674901935139,0.97195394160553528,0.85412342208774528,0.21497405242217885,6.864005415120232E-2,4.2350413332197814E-2,1,0.21790495661297871,0.16759239936390063,0.38901362245809967,0.11740651161887371,0.10429332939743777,null,null,null,"Territoires du Nord-Ouest",1.0887912087912088,0.22]
[null,null,"TCSP",3.0657843968145464,1.6370460300167013,1.1409472514324928,0.2729871582229042,0.11935515507217725,5.694392215860853E-2,1,0.45468578694284212,0.22402247377736256,0.60334805017214665,0.22089689566954693,0.13893376758982939,null,null,null,"Nouvelle-Écosse",0.79865049167620827,0.28000000000000003]
[null,null,"Commerce de gros",4.6931492704207649,1.532826712669598,1.5004894786388436,0.38994482636068573,0.1045232691577718,7.4999441547261861E-2,1,0.35117782987555607,0.2943248076623563,0.6308450161061484,0.1933147395318057,0.18284858074880331,null,null,null,"Nunavut",1.172161172161172,0.2]
[null,null,"Commerce de détail",11.217182313067834,1.7773681478630416,1.6176418178761662,0.41214628062505793,0.11638749452082064,8.0810324404940057E-2,1,0.40972097568788257,0.317263111534689,0.61139866223825112,0.23276204985139148,0.19716053026031244,null,null,null,"Ontario",1.0192051772706401,0.23]
[null,null,"FAI",2.7277499562457175,2.2626286222271679,1.0703681060216235,0.2168613226748545,0.15198562401046542,5.3620659081984115E-2,1,0.45873637919195442,0.20997422128485174,0.57149332742429026,0.25036265010743525,0.13059686819527541,null,null,null,"Île-du-Prince-Édouard",0.79998250998250997,0.27]
[null,null,"Services divers",6.7933221407507745,1.4668673442708726,1.2511723120359328,0.34577217631898532,8.5951371895303941E-2,6.2667770037947212E-2,1,0.26262096254896167,0.24541154665088627,0.71103356372720206,0.14505568809175895,0.15243509623889959,null,null,null,"Québec",0.89527335477306713,0.33]
[null,null,"Services professionels",4.9656160759500656,1.6360045027946724,1.5840984161447134,0.43022123007368912,0.10061691680401882,7.9054971359735535E-2,1,0.31614243569304473,0.31068819529471908,0.64415876677689055,0.18183218160520889,0.19336776433071629,null,null,null,"Saskatchewan",1.0577804193921023,0.28000000000000003]
[null,null,"Gouvernement",3.6137525070543379,2.8474266849145966,1.4765247374912036,0.34042480485035886,0.18449554714476821,7.3397171121922095E-2,1,0.50878611281108099,0.2895756813913305,0.51614210650105352,0.31782103740099515,0.17982677178939424,null,null,null,"Yukon",1.1254395604395604,0.22]
[null,null,null,null,null,null,null,null,null,null,null,null,null,null,null,null,null,null,"MARÉGION",{"$f":"VLOOKUP(RégionPersonnalisée!B5,Multiplicateurs!S8:T21,2,FALSE)","v":1},{"$f":"VLOOKUP(RégionPersonnalisée!B5,Multiplicateurs!S8:U21,3,FALSE)","v":0.16}]
[]
[null,null,"DPC Ferme / Ménage"]
[null,null,"Agriculture",{"$f":"IF(C1=D44,HFCE_CA,IF(C1=E44,HFCE_AB,IF(C1=F44,HFCE_BC,IF(C1=G44,HFCE_MB,IF(C1=H44,HFCE_NB,IF(C1=I44,HFCE_NL,IF(C1=J44,HFCE_NT,IF(C1=K44,HFCE_NS,IF(C1=L44,HFCE_NU,IF(C1=M44,HFCE_ON,IF(C1=N44,HFCE_PE,IF(C1=O44,HFCE_QC,IF(C1=P44,HFCE_SK,IF(C1=Q44,HFCE_YK,IF(C1=R44,HFCE_MR,HFCE_0)))))))))))))))","v":1.2826751403508269E-2}]
[null,null,"Exploitation minière",3.1955113599414059E-3]
[null,null,"Construction",5.4669984674305012E-4]
[null,null,"Secteur manufacturier",0.19030130964258454]
[null,null,"Fabrication de produits métalliques",2.2986827546522923E-4]
[null,null,"Machinerie",2.8965123882979272E-3]
[null,null,"Équipements électriques",4.1831116444123097E-3]
[null,null,"TCSP",4.6599863795727892E-2]
[null,null,"Commerce de gros",3.9507434556328921E-2]
[null,null,"Commerce de détail",0.12601101550159335]
[null,null,"FAI",0.14235107517645768]
[null,null,"Services divers",0.40946507456889053]
[null,null,"Services professionels",4.8050283428880611E-3]
[null,null,"Gouvernement",1.7080743497160787E-2]
[]
[]
[null,null,"Modèle de dépenses personnelles de consommation (DPC)"]
[null,null,"National, provincial et territorial"]
[null,null,2017]
[null,null,null,"Canada","Alberta","Colombie-Britannique","Manitoba","Nouveau-Brunswick","Terre-Neuve-et-Labrador","Territoires du Nord-Ouest","Nouvelle-Écosse","Nunavut","Ontario","Île-du-Prince-Édouard","Québec","Saskatchewan","Yukon","MARÉGION"]
[null,null,"Agriculture",1.4435171003612498E-2,1.2826751403508269E-2,1.313641116120277E-2,1.3282991105438799E-2,1.5510984489813714E-2,1.1923691486361221E-2,1.5419480154327035E-2,1.176082751065757E-2,1.263646045079578E-2,1.5350892535221615E-2,1.5123459039957626E-2,1.4983089549126423E-2,1.1811532797400473E-2,1.0643399431492196E-2,{"$f":"U_PCE","v":0},0]
[null,null,"Exploitation minière",2.4554301482389595E-3,3.1955113599414059E-3,1.1307895102215437E-3,2.2020241746908979E-3,1.0599794881849373E-3,4.0808375140429128E-4,5.3528884189638244E-4,1.093074939157362E-3,5.5208909018906831E-4,3.7950961323085968E-3,6.1476659502582829E-4,6.5003630059421824E-4,4.0450929164711283E-3,3.0827670434107192E-4,0,0]
[null,null,"Construction",4.602745267532699E-4,5.4669984674305012E-4,4.6541061839701006E-4,5.5438416299859498E-4,5.2738121293519308E-4,5.7322076890079594E-4,5.6854162195266319E-4,1.4014753246456432E-3,4.1967897919494712E-4,4.2619312169961323E-4,4.4251789299593693E-4,4.0039815017557157E-4,4.9668390077629572E-4,4.7634659300263809E-4,0,0]
[null,null,"Secteur manufacturier",0.19759118718899898,0.19030130964258454,0.17087926456709124,0.19703778492404808,0.23036691514787264,0.22168361156143096,0.20810955212717497,0.15419483717387611,0.18196001976915085,0.19716374693644348,0.22261895367687307,0.21890753058267237,0.19266157978462292,0.14846042525983519,0,0]
[null,null,"Fabrication de produits métalliques",1.9671260478334248E-4,2.2986827546522923E-4,1.5647006322018771E-4,2.1843829676122743E-4,1.6442217031294759E-4,1.9740482260052089E-4,1.2077694738620328E-4,1.0484737085158778E-4,1.1998202468115719E-4,1.8012107952884788E-4,2.70720809687021E-4,2.4136348209440547E-4,1.8766727923696027E-4,9.9381949657112892E-5,0,0]
[null,null,"Machinerie",2.7757579452984391E-3,2.8965123882979272E-3,2.2886579559478924E-3,2.886942137619797E-3,3.0795625882857631E-3,2.3166012727081518E-3,2.2603352684354011E-3,2.2085525500090963E-3,4.1375796087008204E-3,2.8606139394172481E-3,2.4367257913391607E-3,2.9429542527304562E-3,3.2151732074401844E-3,3.4809672852476005E-3,0,0]
[null,null,"Équipements électriques",3.9892708080174919E-3,4.1831116444123097E-3,4.0152737403384552E-3,3.8594088107437086E-3,3.945429283746393E-3,3.617564375124453E-3,3.5195857967809064E-3,3.1923260167921758E-3,2.4530738256723968E-3,3.9942231283129764E-3,3.3040499255728014E-3,4.046517402366551E-3,4.1330869206017262E-3,2.3178760070949852E-3,0,0]
[null,null,"TCSP",4.8955808051950975E-2,4.6599863795727892E-2,4.5582011884255945E-2,5.0608872438187326E-2,5.8138145143807878E-2,6.5207672372036007E-2,5.4178106681688896E-2,6.2544463224896832E-2,6.0788723514663134E-2,4.9438233094220435E-2,4.8856224782883505E-2,4.9644840445646564E-2,4.6371113550571309E-2,6.7996653397244158E-2,0,0]
[null,null,"Commerce de gros",4.130474105198649E-2,3.9507434556328921E-2,3.7170437967590751E-2,4.2264849933566828E-2,4.9905419959425899E-2,4.8335801251417544E-2,4.6531982980964844E-2,3.4496218126437043E-2,3.9181525689148511E-2,4.006785719470278E-2,4.8061658841432542E-2,4.5718229139283056E-2,4.2335307577117468E-2,3.5258513783666408E-2,0,0]
[null,null,"Commerce de détail",0.12520653113824426,0.12601101550159335,0.12112306277123344,0.127785739098498,0.13083382525736564,0.13835695645742996,0.12738737701065775,9.7697644759784402E-2,0.15337205445599761,0.11952095967008144,0.12641418442138883,0.13618323325408266,0.13045000533027001,0.13541700076995397,0,0]
[null,null,"FAI",0.14938633546453847,0.14235107517645768,0.1584240255785696,0.13522686373094675,0.12028830478818847,0.11134592171359189,0.12691246746891241,0.15536268715542106,0.19755743115739219,0.151697553958835,0.12326826647496131,0.15590144582210297,0.13378256365740238,0.13328976654899766,0,0]
[null,null,"Services divers",0.39405381056074501,0.40946507456889053,0.42740584320326597,0.40098439754231907,0.36726378236888557,0.38235589312575974,0.40988475751957199,0.26349213283151163,0.2643420558544104,0.39439296313210909,0.38968337061115804,0.35799487045149386,0.40277032110632677,0.44060098542959586,0,0]
[null,null,"Services professionels",3.9201504535501903E-3,4.8050283428880611E-3,3.9625766938915308E-3,3.5174799596733859E-3,3.1037066797282666E-3,1.4742246130505421E-3,3.1471810744483466E-3,1.7620250038621311E-3,2.2317757628641851E-3,4.2766776964329196E-3,2.2454438675134298E-3,3.1506819996120093E-3,3.3259196090634048E-3,1.9326652561007305E-3,0,0]
[null,null,"Gouvernement",1.5268819053281611E-2,1.7080743497160787E-2,1.4259764284773825E-2,1.9569823684507524E-2,1.5812141421446588E-2,1.2203352428183857E-2,1.4245665058021854E-3,0.21068888801209731,8.0247549817139122E-2,1.6834868380685757E-2,1.6659657269210804E-2,9.2348091680189599E-3,2.4413952362699002E-2,1.9717741583770362E-2,0,0]
[null,null,null,{"$f":"SUM(D45:D58)","v":1.0000000000000002},{"$f":"SUM(E45:E58)","v":1.0000000000000002},1.0000000000000002,1,1,0.99999999999999989,0.99999999999999989,0.99999999999999989,1.0000000000000002,0.99999999999999967,0.99999999999999978,1,1,0.99999999999999978,0]
[]
[null,null,"Multiplicateurs"]
[null,null,"Nationaux, provinciaux et territoriaux"]
[null,null,2017]
[null,null,null,null,"Emplois",null,null,"Revenus d'emploi",null,null,"Extrant",null,null,"Valeur ajoutée"]
[null,null,null,null,"Direct","Indirect","Induit","Direct","Indirect","Induit","Direct","Indirect","Induit","Direct","Indirect","Induit"]
[null,null,"Canada","Agriculture",3.4081857727180882,2.7316639366402549,1.1604597262698344,0.16152071043585398,0.16103680182687446,5.6739595419727229E-2,1,0.69193266752277005,0.21031548092623742,0.48722875180688707,0.33494927627359211,0.12191525530598135]
[null,null,null,"Exploitation minière",0.82917153574039315,2.3745845299942663,1.3734335036841678,0.13282652745114898,0.1673484529592475,6.6936901767330789E-2,1,0.51622310205849742,0.24927286445004224,0.57587653763654467,0.28375181718580605,0.14449052132511903]
[null,null,null,"Construction",3.937854252235562,3.319654044415199,2.2494414988500564,0.29164922493714757,0.21922963015961544,0.10946653479254601,1,0.69000825691835455,0.40795107879649423,0.42961235623753125,0.34853997593592145,0.2365151380504166]
[null,null,null,"Secteur manufacturier",1.9352198496078343,2.7462483021162094,1.3754068027363859,0.14917196150743789,0.17401964475071952,6.6853941408313161E-2,1,0.74934696677457668,0.2494403817020473,0.26622502220348426,0.33634019085552364,0.14461751086724026]
[null,null,null,"Fabrication de produits métalliques",3.6526406690144539,2.78941596391924,2.0309328672274582,0.27455022946432345,0.18906218314082504,9.8832528413894352E-2,1,0.70426310099811862,0.36825356207993393,0.37884689684871287,0.31521528629211215,0.213344482090396]
[null,null,null,"Machinerie",3.5332878485216699,2.3728863028435643,1.9717633650840229,0.27830764083598952,0.16038205899298219,9.6090511144436314E-2,1,0.54098784997654725,0.35769326266288676,0.40366306656489592,0.26116320700183832,0.20755094692552478]
[null,null,null,"Équipements électriques",3.3668769246013706,1.753003847887757,1.7176649051211301,0.2730637950317481,0.11469556330205964,8.3599274192729917E-2,1,0.3817292941979355,0.31133251495345388,0.40910590674067671,0.19004877708912557,0.18067184657084426]
[null,null,null,"TCSP",3.7259525839161025,2.882326609203433,1.9939622146070606,0.27714231649198373,0.17689751672859821,9.6990296042849783E-2,1,0.64101914021829409,0.36176577245341396,0.57383592486363211,0.31066123361277126,0.20962607179414575]
[null,null,null,"Commerce de gros",4.7356952628168631,2.8879240704477933,2.4032165565273931,0.34903798450029122,0.16875842287731041,0.11688267096834234,1,0.53023421136154147,0.43614605628407199,0.61176132740698752,0.2817770797445468,0.25284972627340074]
[null,null,null,"Commerce de détail",12.342755180523792,2.9716324203026914,2.8180330317396707,0.4335869437878978,0.17262034989134867,0.13705638634218084,1,0.56704670400124224,0.51128234693712638,0.60422396735805961,0.31237811528578224,0.296412119633996]
[null,null,null,"FAI",2.9267964588717965,3.5757805278088419,1.927878129494234,0.21797976084624085,0.21921468786458856,9.3799861950310801E-2,1,0.6298885187102693,0.34986218801329205,0.54612730041529023,0.34946800691691426,0.2028022174165911]
[null,null,null,"Services divers",7.5849154714670304,2.2142973514026751,2.1475885933936176,0.40703160853912063,0.12619496779505968,0.10442188829774252,1,0.38079665517476452,0.38970165487317482,0.69978404730478483,0.20629843972324854,0.22600857861459697]
[null,null,null,"Services professionels",5.8227286105668217,2.8673678569012795,2.8644807526604366,0.46586665778544628,0.16806265138453028,0.13956313455509148,1,0.47952684655261885,0.51958980230725671,0.63842200276011651,0.27113360320239066,0.30110897702046019]
[null,null,null,"Gouvernement",4.474281446022685,3.4298716373152232,2.5480955897974309,0.38679830744924781,0.20875079101816493,0.12418389157009373,1,0.58166779028965698,0.46263482997442623,0.53899345011530519,0.34715147307266209,0.26797969855593484]
[]
[]
[null,null,null,null,"Emplois",null,null,"Revenus d'emploi",null,null,"Extrant",null,null,"Valeur ajoutée"]
[null,null,null,null,"Direct","Indirect","Induit","Direct","Indirect","Induit","Direct","Indirect","Induit","Direct","Indirect","Induit"]
[null,null,"Alberta","Agriculture",2.2940527386729013,1.9750425956620221,0.51593913894350463,7.3079135790848945E-2,0.11875997599486887,2.6173647953961796E-2,1,0.58751951493484034,0.10204619543906382,0.46211098090700664,0.2596545939896881,6.3120526123851203E-2]
[null,null,null,"Exploitation minière",0.71394416125850468,1.6609846845741649,0.80523819342035574,0.13324700193082645,0.13721989990211844,4.0238380504414424E-2,1,0.4175383696517434,0.15862860272277921,0.54165475734401591,0.23363132532224554,9.8136950424575098E-2]
[null,null,null,"Construction",3.4865808507104501,2.0789526318639258,1.3563346242124157,0.29457007747499669,0.16104352236118666,6.757569946374041E-2,1,0.49737581426511562,0.26628433052620709,0.41023870108301225,0.27109394040776225,0.16546476799882354]
[null,null,null,"Secteur manufacturier",1.4171204407640987,2.2126674869579377,0.74582759043794045,0.11543200808032471,0.14753294103156853,3.7133396399076361E-2,1,0.81731696435816992,0.1467888261577345,0.32217221938442731,0.35689916349596379,9.1169279531665662E-2]
[null,null,null,"Fabrication de produits métalliques",3.0012062854899413,1.5862975213782731,1.1387536164644152,0.260398549196458,0.12035720328362244,5.7030263938031782E-2,1,0.3965963328014972,0.22369522460401686,0.35863469672795328,0.19806052787606354,0.13886274427102432]
[null,null,null,"Machinerie",2.792758336694865,1.5362496681371101,1.1152944426318436,0.24867423266194844,0.11889068760137504,5.591328700111884E-2,1,0.37831396483596302,0.21918068711178124,0.39326138922123544,0.19557394510766968,0.13590358570239164]
[null,null,null,"Équipements électriques",2.6118674901935139,0.97195394160553528,0.85412342208774528,0.21497405242217885,6.864005415120232E-2,4.2350413332197814E-2,1,0.21790495661297871,0.16759239936390063,0.38901362245809967,0.11740651161887371,0.10429332939743777]
[null,null,null,"TCSP",3.0657843968145464,1.6370460300167013,1.1409472514324928,0.2729871582229042,0.11935515507217725,5.694392215860853E-2,1,0.45468578694284212,0.22402247377736256,0.60334805017214665,0.22089689566954693,0.13893376758982939]
[null,null,null,"Commerce de gros",4.6931492704207649,1.532826712669598,1.5004894786388436,0.38994482636068573,0.1045232691577718,7.4999441547261861E-2,1,0.35117782987555607,0.2943248076623563,0.6308450161061484,0.1933147395318057,0.18284858074880331]
[null,null,null,"Commerce de détail",11.217182313067834,1.7773681478630416,1.6176418178761662,0.41214628062505793,0.11638749452082064,8.0810324404940057E-2,1,0.40972097568788257,0.317263111534689,0.61139866223825112,0.23276204985139148,0.19716053026031244]
[null,null,null,"FAI",2.7277499562457175,2.2626286222271679,1.0703681060216235,0.2168613226748545,0.15198562401046542,5.3620659081984115E-2,1,0.45873637919195442,0.20997422128485174,0.57149332742429026,0.25036265010743525,0.13059686819527541]
[null,null,null,"Services divers",6.7933221407507745,1.4668673442708726,1.2511723120359328,0.34577217631898532,8.5951371895303941E-2,6.2667770037947212E-2,1,0.26262096254896167,0.24541154665088627,0.71103356372720206,0.14505568809175895,0.15243509623889959]
[null,null,null,"Services professionels",4.9656160759500656,1.6360045027946724,1.5840984161447134,0.43022123007368912,0.10061691680401882,7.9054971359735535E-2,1,0.31614243569304473,0.31068819529471908,0.64415876677689055,0.18183218160520889,0.19336776433071629]
[null,null,null,"Gouvernement",3.6137525070543379,2.8474266849145966,1.4765247374912036,0.34042480485035886,0.18449554714476821,7.3397171121922095E-2,1,0.50878611281108099,0.2895756813913305,0.51614210650105352,0.31782103740099515,0.17982677178939424]
[]
[]
[null,null,null,null,"Emplois",null,null,"Revenus d'emploi",null,null,"Extrant",null,null,"Valeur ajoutée"]
[null,null,null,null,"Direct","Indirect","Induit","Direct","Indirect","Induit","Direct","Indirect","Induit","Direct","Indirect","Induit"]
[null,null,"Colombie-Britannique","Agriculture",3.1198520407918702,1.9274148333555765,0.84161106975094457,0.12877606501729591,0.11511402437255613,3.9904984876166186E-2,1,0.44146559608333391,0.15381019146511463,0.5480874408256694,0.24583584117139332,9.8739849928573514E-2]
[null,null,null,"Exploitation minière",0.97129657954132254,1.4244565834073748,0.8162560133833533,0.13203182923468515,9.6717756365142779E-2,3.9002550580411605E-2,1,0.29167207753896163,0.14928263659653654,0.59679696613626343,0.16439746007699313,9.5751073964942868E-2]
[null,null,null,"Construction",3.781447151985303,2.2251990399826314,1.4122956492539329,0.26249266938563492,0.15013443420527531,6.7407624886753184E-2,1,0.43819443505898314,0.25821564883177883,0.40129729660659974,0.2301740583864908,0.16591705200022944]
[null,null,null,"Secteur manufacturier",2.5694827398291267,2.4500156821686137,1.2228217309595173,0.20237681510949668,0.16269569858120808,5.8199372081817483E-2,1,0.60285222563752949,0.22358686629359345,0.31699757378658888,0.28132883488825478,0.14361279124210607]
[null,null,null,"Fabrication de produits métalliques",3.8594118994609485,1.7737177046372063,1.4208173583514312,0.28431582865411464,0.11244817036570234,6.7713276435856673E-2,1,0.35505293668463506,0.2602073185371907,0.40681693570445204,0.18080238315946637,0.16720246768886218]
[null,null,null,"Machinerie",3.3396036728023262,1.6313562126487888,1.3986057750068648,0.29508471279191084,0.10561151191092169,6.6677205484922619E-2,1,0.30737081253801318,0.25576277203615216,0.3644643757983631,0.1636707595810839,0.16440188099749073]
[null,null,null,"Équipements électriques",4.2729827018493518,1.1374773251076935,1.5439088420025353,0.35610607714761566,7.1107093585093956E-2,7.3865881278688816E-2,1,0.20725715447469717,0.28239594878100138,0.4730068547735416,0.11514510419120713,0.181436559999791]
[null,null,null,"TCSP",3.2765791326500344,2.1469075308411796,1.3684962354869217,0.25479696536944718,0.13482150400467183,6.5112875759789551E-2,1,0.42124062346666558,0.25041558199887876,0.54789234741433468,0.21867788014402942,0.16091180845851411]
[null,null,null,"Commerce de gros",6.4991218200458336,1.9052477007334605,2.1094652144362005,0.45604622298093622,0.11235422820822044,0.10034682853843889,1,0.33813395790115758,0.38591191920496748,0.64256150289672309,0.18867007347051393,0.24796518717537103]
[null,null,null,"Commerce de détail",11.140866755695733,2.1184499555677339,2.0689850480355938,0.44040237770165974,0.12069390226839607,9.8552260241132963E-2,1,0.39595158719121132,0.37848911307395139,0.61422635822446592,0.2277970728103775,0.24331078748908072]
[null,null,null,"FAI",2.4934322929226873,2.8400847027598624,1.1965943274403936,0.18605441907611736,0.1656484744343909,5.6806293839158292E-2,1,0.48035535259796236,0.21864861168277877,0.56339236715410101,0.26445242359812798,0.14066955573713455]
[null,null,null,"Services divers",7.0612361989092092,1.7512125448039095,1.4735304237669915,0.32479312735813759,9.5647142190525183E-2,7.0018787620418882E-2,1,0.2632633076079664,0.26970961186145803,0.69460658095330796,0.1513838164865032,0.17336023692680377]
[null,null,null,"Services professionels",5.9595470783309032,1.8110751996470182,2.0499886324909964,0.48794916412010497,0.1025556343587976,9.762922906803144E-2,1,0.28414491180315155,0.37493955894890191,0.67326249549581629,0.16567840312108784,0.24091795020263487]
[null,null,null,"Gouvernement",4.5695889826297913,3.0928772847551755,1.8970074170434303,0.37742820062183124,0.19587837117021975,9.0453144403339653E-2,1,0.51020644677026439,0.34699790577282164,0.51096128708312316,0.31177274609175915,0.22306002786631049]
[]
[]
[null,null,null,null,"Emplois",null,null,"Revenus d'emploi",null,null,"Extrant",null,null,"Valeur ajoutée"]
[null,null,null,null,"Direct","Indirect","Induit","Direct","Indirect","Induit","Direct","Indirect","Induit","Direct","Indirect","Induit"]
[null,null,"Manitoba","Agriculture",2.5658109247951462,1.6106017330414333,0.45602409632543317,7.8730063497839203E-2,8.3319697215317165E-2,1.9993174430658293E-2,1,0.36088124555856776,7.4903332694513158E-2,0.45871405790510072,0.1849830617944479,4.918883185852467E-2]
[null,null,null,"Exploitation minière",0.71562643599586973,0.81838760820310408,0.43344354183459138,7.8693096661465511E-2,5.5450854624740427E-2,1.8804212620859202E-2,1,0.1481610043722526,7.140540878404486E-2,0.75426140447043488,8.9024858029859613E-2,4.7261450280417158E-2]
[null,null,null,"Construction",3.73432810345949,2.0486466061435391,1.1856156915538472,0.26322122860410563,0.12139264625989624,5.1640566659631043E-2,1,0.34335940988005281,0.19501332422592058,0.36431316437351013,0.18594783291017719,0.12823295752172648]
[null,null,null,"Secteur manufacturier",2.8794578938253741,1.6775197898761007,0.86175275948409313,0.19715726040908185,9.1344981717980347E-2,3.7483650620654299E-2,0.99996201500327908,0.40481156307031407,0.14190418998650994,0.33196320083914893,0.1962792710509273,9.3311651726250069E-2]
[null,null,null,"Fabrication de produits métalliques",4.0220677698649379,1.502767340233081,1.0877579542453724,0.25438561884662103,9.0466910601224332E-2,4.7096404711655264E-2,1,0.30249713651532828,0.1791115176687072,0.38526654469938781,0.1572003659018365,0.11810396119018124]
[null,null,null,"Machinerie",3.2316889360964596,1.4187783061582591,0.9588205654076366,0.22897797112937224,8.5711917653396877E-2,4.1820629110848308E-2,1,0.29726844186667428,0.15779744542122204,0.40907150890437838,0.1513301673233641,0.10373493949937419]
[null,null,null,"Équipements électriques",3.9869545987867991,1.1092501298251376,1.1083285047130458,0.28796138339373251,6.712429271490733E-2,4.8187404558073785E-2,1,0.2116582279498202,0.18235416349371325,0.42405527452564856,0.11316034167138206,0.11986823575454465]
[null,null,null,"TCSP",3.6458296076960077,1.5723439087532949,1.0932032083458585,0.2784172919577404,8.6848124615785824E-2,4.7530860781415399E-2,1,0.26368176148623995,0.17981153939302605,0.63041953387136918,0.13602444307466807,0.11838551903584717]
[null,null,null,"Commerce de gros",5.2080499395121853,1.5563876096769311,1.3752070308727411,0.33826306966572955,8.4108425608422063E-2,5.989967560148652E-2,1,0.26003015601984508,0.22621269955180617,0.63959560103822966,0.14833088014484158,0.14912648845729959]
[null,null,null,"Commerce de détail",11.854519785753837,1.7873779646594414,1.595255679282515,0.39889146667955827,9.2860246094019411E-2,6.9526855966585865E-2,1,0.30400933744639635,0.26211876813441237,0.64687514167631976,0.17651547748269722,0.17277962549607453]
[null,null,null,"FAI",2.587852408824431,2.5811759326628119,1.0528575538743226,0.19341629037642399,0.15253322868806007,4.5792617788752883E-2,1,0.41926599107146278,0.1732187509613039,0.52578626150006824,0.2419264318134961,0.11406484275035861]
[null,null,null,"Services divers",8.6372216842335376,1.3931058877675311,1.449779269245113,0.39423955145353184,7.260631582666037E-2,6.3149423133791169E-2,1,0.19495396697870337,0.23850736357281613,0.71963085791998249,0.1170196024136787,0.1569855457097471]
[null,null,null,"Services professionels",6.4236994094522073,1.6589819578636662,1.5996677430861534,0.44925064656203045,8.1506032400361292E-2,7.0066595249790184E-2,1,0.24031599969819348,0.26317744499633883,0.67139981039170715,0.14079869933273881,0.17335718854478938]
[null,null,null,"Gouvernement",5.6143010250736838,2.8182713595616198,1.6235237253062627,0.39071943546991639,0.14959607833569952,7.0838402024584662E-2,1,0.40892341828754103,0.26722148288679726,0.53230852321694166,0.25411657175192409,0.17574169628924519]
[]
[]
[null,null,null,null,"Emplois",null,null,"Revenus d'emploi",null,null,"Extrant",null,null,"Valeur ajoutée"]
[null,null,null,null,"Direct","Indirect","Induit","Direct","Indirect","Induit","Direct","Indirect","Induit","Direct","Indirect","Induit"]
[null,null,"Nouveau-Brunswick","Agriculture",4.3001074133225359,1.4692248525909963,0.76697847399784902,0.18870851483019455,7.1449546464000591E-2,3.0303812079445568E-2,1,0.30800605180248963,0.12193852160581192,0.561281192004214,0.13096085664316032,7.4926572325480084E-2]
[null,null,null,"Exploitation minière",4.0865130761481279,0.77984990262326237,0.9686339872310693,0.28581065665882532,4.4908120928329492E-2,3.797432825740351E-2,1,0.16001526950910117,0.15372479832221994,0.64668735979517367,7.5763045834052536E-2,9.4288117580246356E-2]
[null,null,null,"Construction",5.3681979811514831,1.9409070780191215,1.2033257705172562,0.30433339668001674,0.10173404153072713,4.7179575805059798E-2,1,0.31650793049616205,0.19084709965064298,0.45470910207376714,0.15650428438901443,0.11744880764115163]
[null,null,null,"Secteur manufacturier",1.3293927178272273,1.0308616932394548,0.40041445063904241,7.9878747963138527E-2,5.4622023808172118E-2,1.5560850896698258E-2,0.99999108924385183,0.23570915362119127,6.3869056615811312E-2,0.14848511812594528,0.10433943502741855,3.9107878671258492E-2]
[null,null,null,"Fabrication de produits métalliques",5.0273499097992129,1.531996943177123,1.1782671070523145,0.28761792642827277,8.1154481607068188E-2,4.6436321071378794E-2,1,0.28279162876763564,0.18674528428551518,0.34671816053568938,0.1398726421427576,0.11491898662487804]
[null,null,null,"Machinerie",5.3081020790257512,0.94281139999321417,1.0722738662268914,0.28395973294778254,4.8164756770096913E-2,4.1981752268642474E-2,1,0.15619575629208629,0.16999478645360996,0.39873928284412846,7.9756847218579424E-2,0.1047276117028204]
[null,null,null,"Équipements électriques",5.9832618068643564,0.9336641290716291,1.19386256939367,0.31319365365288404,4.7414984800661211E-2,4.7225849482335713E-2,0.99982803804173903,0.14520701823464577,0.18885084736477814,0.4622264210350035,7.5510098715831406E-2,0.11636806440363145]
[null,null,null,"TCSP",3.007700822863971,1.9956085891703625,0.89172341393699028,0.20411923746720217,0.10204106013350361,3.5072328149323435E-2,1,0.4279643995599835,0.14129504816371005,0.47561912253839572,0.17959696036093423,8.7215843998895995E-2]
[null,null,null,"Commerce de gros",6.2538587922842446,1.6851212293918634,1.4552789050960917,0.3758578933696512,8.8888369439560341E-2,5.7250434535743945E-2,1,0.28192557973651161,0.230790211908971,0.6157906531923103,0.15197018473835103,0.14226041955528279]
[null,null,null,"Commerce de détail",13.421379689662515,1.8776174033994726,1.6429728340799867,0.42724726333011293,9.3196222362202777E-2,6.4516200858040801E-2,1,0.31822672879452196,0.26042891471468882,0.61529793714631908,0.1758587513221721,0.16052338076984368]
[null,null,null,"FAI",2.6944216466063766,2.4730088126577559,0.88294703930059848,0.17216921792674064,0.12838525450163704,3.461513758757314E-2,1,0.39005956001737802,0.139905118078539,0.55725235130597817,0.21718851162108346,8.6447075550740188E-2]
[null,null,null,"Services divers",7.9599409957841845,1.5097928255371456,1.2255643668937357,0.33987748595399769,7.0232026085318519E-2,4.8038896378831297E-2,1,0.21119628168049007,0.19414876025222172,0.6919680823185913,0.11689669360440244,0.11947571953497539]
[null,null,null,"Services professionels",7.775622706409191,1.5177639625092614,1.800216803632984,0.52699096010796675,6.900720644555064E-2,7.0756322623285933E-2,1,0.20233573914567651,0.28529547435105013,0.70315870643666467,0.11720220726957695,0.17566858222104326]
[null,null,null,"Gouvernement",5.682697353891915,2.1148504445426899,1.582047048373685,0.45296092710309593,0.10902502130412123,6.222712410892161E-2,1,0.31304557845703518,0.25090467261248806,0.59018968693331908,0.18196165410810566,0.15469491871573846]
[]
[]
[null,null,null,null,"Emplois",null,null,"Revenus d'emploi",null,null,"Extrant",null,null,"Valeur ajoutée"]
[null,null,null,null,"Direct","Indirect","Induit","Direct","Indirect","Induit","Direct","Indirect","Induit","Direct","Indirect","Induit"]
[null,null,"Terre-Neuve-et-Labrador","Agriculture",1.9232693217036834,1.3835228180352528,0.36921658918685735,0.10794592248737554,8.585645827017345E-2,1.7810026271517922E-2,1,0.30146690440563373,6.5765477339553194E-2,0.48318029580207356,0.1501237194352727,4.1904718691131604E-2]
[null,null,null,"Exploitation minière",0.42777300012614883,0.6009787554413879,0.29794789292655682,7.0351113355324429E-2,5.205540952720928E-2,1.4280390383506602E-2,1,0.16717026285425357,5.2713855083001596E-2,0.73378151542888048,7.7332562717466968E-2,3.3758672533428423E-2]
[null,null,null,"Construction",2.8495773686709587,1.5149840090118756,0.90227918488267789,0.24426074590829874,0.1205649167926509,4.33929449956547E-2,1,0.33034929538425661,0.16030068149272367,0.40550975551122614,0.17399690872514148,0.10250134517681712]
[null,null,null,"Secteur manufacturier",1.3151734252229197,1.2778762214195358,0.43418593470431249,0.12209989593902705,8.4264409173294558E-2,2.0700881112794174E-2,0.99997838164693065,0.46291339078861388,7.6856795227584457E-2,0.23109151983070961,0.24721023468413117,4.9336397991839323E-2]
[null,null,null,"Fabrication de produits métalliques",4.8330054336633133,1.0437841282657376,1.1099978975313687,0.48379336275015111,6.95892484626595E-2,5.3205375768670252E-2,1,0.19550735045142714,0.19739689162193869,0.40098487860341953,0.10734271344150997,0.12630113369530446]
[null,null,null,"Machinerie",4.8364511038913651,0.82592640071867773,1.1588942789225511,0.42902180879617485,5.9812228034684917E-2,5.5537035085482078E-2,1,0.16908501293361872,0.20551103535138956,0.42367482152965397,9.3415810773612842E-2,0.13179589468854064]
[null,null,null,"Équipements électriques",6.0992465089876546,1.3767908955859758,1.4673907284366574,0.52704754606791759,9.4570255769224912E-2,7.0337309210210308E-2,1,0.24681655685416645,0.26049693642640864,0.73014481245152074,0.14190756497943521,0.16716158456146182]
[null,null,null,"TCSP",3.4801882622369278,1.1572813915768936,0.89812284269441789,0.30242118132716245,8.0239463967009303E-2,4.3294990991023588E-2,1,0.31529350693471864,0.15928702050222251,0.52853966192734736,0.14087496230855154,0.10233107587254606]
[null,null,null,"Commerce de gros",6.1987555013615978,0.99126736506993407,1.2745274225030667,0.44943649067805963,6.8863802369507454E-2,6.1513527325593717E-2,1,0.19983315580544939,0.22637583138042114,0.71141158484389233,0.1145879711198384,0.14493764629598588]
[null,null,null,"Commerce de détail",10.86378768344338,1.6007233970659178,1.281917676361787,0.4175173702338088,9.9433099183280582E-2,6.1666828432714343E-2,1,0.28898661783654311,0.22762788440136769,0.63893191657176063,0.16913444190508162,0.14580546225844296]
[null,null,null,"FAI",2.7904030900554231,1.8509588297264246,0.8099938936511224,0.21543607980643492,0.12564006037041428,3.8723738122124055E-2,1,0.35734648063637231,0.14372887534972356,0.57631384791647511,0.19477828133902725,9.1833401741963624E-2]
[null,null,null,"Services divers",7.0800907168061906,1.1449541313145559,1.0722024632223508,0.39570079137504482,6.7341127078464985E-2,5.1494151411549768E-2,1,0.18000688634868189,0.19029934002495064,0.71869517300401298,0.10157753212953696,0.12218401405663849]
[null,null,null,"Services professionels",4.9328009534315971,1.0690441547793852,1.2024593680928319,0.42814499454477623,6.7872867453736482E-2,5.7715176398323027E-2,1,0.18512800042293637,0.21321546485505166,0.81684952907396646,0.11040533269169273,0.13681128756973818]
[null,null,null,"Gouvernement",4.8147783305576031,2.5232961434054757,1.2764604599210609,0.39088590516386046,0.1607135618943267,6.1055241241053021E-2,1,0.41512502399480355,0.2266515749163856,0.53764253689003871,0.24985382422162711,0.14498026579023027]
[]
[]
[null,null,null,null,"Emplois",null,null,"Revenus d'emploi",null,null,"Extrant",null,null,"Valeur ajoutée"]
[null,null,null,null,"Direct","Indirect","Induit","Direct","Indirect","Induit","Direct","Indirect","Induit","Direct","Indirect","Induit"]
[null,null,"Territoires du Nord-Ouest","Agriculture",11.182203302416463,0.36952365928886161,0.28621462148632465,0.26615285839183139,3.1657076886350013E-2,1.8330242715783807E-2,1,8.9004152201325556E-2,7.7738014081320167E-2,0.55912611337157958,5.3875239827820116E-2,5.0942611889986528E-2]
[null,null,null,"Exploitation minière",0.9873710290296368,0.50565524109126492,0.3515523249124084,0.188069181749384,5.0704528366921846E-2,2.243935992274141E-2,1,0.14047393110606321,9.5476767096950632E-2,0.49367402818896489,7.7148808517261663E-2,6.2840645916770091E-2]
[null,null,null,"Construction",1.2792720535033353,0.71982438991760678,0.33148644090634738,0.15850191289956347,7.507071387378958E-2,2.1130657406540215E-2,1,0.1831178528557392,8.9924017636370104E-2,0.27791868037405826,0.10466847776697191,5.9069061694151291E-2]
[null,null,null,"Secteur manufacturier",2.0121508375643153,1.3249927495137741,0.36291941926847332,0.18785428436561949,8.2880184688683078E-2,2.318892507994998E-2,1,0.74418185601876097,9.8694705594141813E-2,0.32332750929338588,0.19485928777949427,6.4343210697827974E-2]
[null,null,null,"Fabrication de produits métalliques",0,0,0,0,0,0,0,0,0,0,0,0]
[null,null,null,"Machinerie",0,0,0,0,0,0,0,0,0,0,0,0]
[null,null,null,"Équipements électriques",0,0,0,0,0,0,0,0,0,0,0,0]
[null,null,null,"TCSP",1.9434990802189862,0.71540934546890811,0.41506733470919888,0.2202729643453066,5.9956378765763915E-2,2.6354343891534404E-2,1,0.20022232961903572,0.11290122650037845,0.41606147123596254,0.10262711075900717,7.381404237007369E-2]
[null,null,null,"Commerce de gros",2.8336722087866812,0.43412791908476156,0.52363817417916525,0.31171101057010608,3.9023286009005773E-2,3.3336553840840673E-2,1,0.12106919477959062,0.14262589120715727,0.80071373224145848,6.6630087233989041E-2,9.3246280349050303E-2]
[null,null,null,"Commerce de détail",9.206228478210587,0.92013684159952003,0.82871056928659925,0.46680030701920644,7.5202235690734351E-2,5.2645225622833781E-2,1,0.25861072509908944,0.22564968467378427,0.64637767924597056,0.1413402245172887,0.14755694762417151]
[null,null,null,"FAI",1.0956300471697826,0.85407132413529108,0.26153305534577886,0.10072329538090691,7.6767467177180318E-2,1.702085224856047E-2,1,0.24491530472672363,7.1182223251839566E-2,0.6432622462988129,0.14171650746153311,4.6283250617911234E-2]
[null,null,null,"Services divers",5.5650849839022687,0.54909646554224656,0.61909753203696727,0.40787400050764405,4.3268612464993451E-2,3.9429004023936627E-2,1,0.13037295087745121,0.16852344037164801,0.7081727873114857,7.4923903240475126E-2,0.11016557844709356]
[null,null,null,"Services professionels",5.7572493424124813,0.66496815127479236,0.76871383113103453,0.53970928532941098,5.2613719153139095E-2,4.8992512264458929E-2,1,0.1684233452211748,0.20900830733721862,0.69362465877497714,9.2345501949314984E-2,0.13669855817436216]
[null,null,null,"Gouvernement",3.7436359626246341,1.2323233709048589,0.64234870875139438,0.38067136129537477,0.10619580700078826,4.1092423084967619E-2,1,0.32096198349277832,0.17509733616709569,0.49206512092363963,0.17607116671098977,0.11438368985323032]
[]
[]
[null,null,null,null,"Emplois",null,null,"Revenus d'emploi",null,null,"Extrant",null,null,"Valeur ajoutée"]
[null,null,null,null,"Direct","Indirect","Induit","Direct","Indirect","Induit","Direct","Indirect","Induit","Direct","Indirect","Induit"]
[null,null,"Nouvelle-Écosse","Agriculture",4.5185634605651908,1.6498121618127379,0.8765130037565616,0.20506854008144462,7.6919161597730198E-2,3.5531728981020229E-2,1,0.25593704274980406,0.1364296371460367,0.55956276358779122,0.1306038492694381,8.7049105470226276E-2]
[null,null,null,"Exploitation minière",1.0974857847667083,2.8837723111376214,1.3050979908113405,0.17212470847504882,0.2600886574682344,5.3145010327485608E-2,1,0.69741600477967358,0.2036398143304283,0.32344825469806665,0.32904408894169263,0.12947145744160934]
[null,null,null,"Construction",5.2414254729379239,2.3218449272287822,1.3579264475607908,0.3071133894855399,0.12392187148359535,5.4863293698671739E-2,1,0.33950088266988887,0.21147113671178738,0.39808768878100714,0.1817127403529179,0.13497735550041137]
[null,null,null,"Secteur manufacturier",3.2850327536333457,2.05208939159195,0.99411805951653209,0.21483183830788954,0.10242006755158482,4.0291454850285784E-2,0.99998246662000045,0.37013492548081628,0.15510542913295672,0.29924419393375751,0.18338010618037148,9.8835288066588325E-2]
[null,null,null,"Fabrication de produits métalliques",5.5077652036830376,1.3311967421110322,1.4603496696207348,0.34795264404006326,7.447266288438896E-2,5.9266052884825039E-2,1,0.21129211519181293,0.22793356942390713,0.4577981586544751,0.11208073653820995,0.1453610953851521]
[null,null,null,"Machinerie",4.9769141989782941,1.1690169858818393,1.4303157230469199,0.35619598022342114,6.6087536458597537E-2,5.8048060771684534E-2,1,0.18264537971418815,0.22301547488558363,0.49881551356125409,9.9812027658104985E-2,0.14227616481729541]
[null,null,null,"Équipements électriques",4.909670076594745,1.0505717921056934,1.3247516627939568,0.3147913419521518,5.7337334355353431E-2,5.3801441611366324E-2,1,0.16187586954191266,0.20686855021679526,0.47193034185300681,9.1084916973032171E-2,0.13213443911060888]
[null,null,null,"TCSP",3.8630255251151699,1.8449660052708396,1.168129664373871,0.26589176579755214,9.6960148203264887E-2,4.7467920495579775E-2,1,0.30857904296460437,0.18200687443294941,0.50248126823165618,0.15916416365478506,0.11620034085696411]
[null,null,null,"Commerce de gros",7.5617301818798648,1.7558025100362304,2.0064287233527955,0.49206117722292309,9.0442889740847993E-2,8.1200383916377586E-2,1,0.27920475335694411,0.31289245123474235,0.61823242407837598,0.15196453117128245,0.19961707189421837]
[null,null,null,"Commerce de détail",14.032052021328276,1.9628001342374952,1.9476117589878061,0.46208926150763291,9.9358507124828951E-2,7.8677980334205005E-2,1,0.33644348986616512,0.30368294798661039,0.61906521187419428,0.18537186174366038,0.19374403754034306]
[null,null,null,"FAI",3.0815361888418247,2.7169912150890179,1.0480981487580232,0.18650925601517063,0.13632628195754354,4.2477161324390222E-2,1,0.39528465507308602,0.16344399940993123,0.53968811693163032,0.21777845613839916,0.10419319562032729]
[null,null,null,"Services divers",8.4584082665988234,1.5017664407940547,1.4622912777912087,0.36957958502757565,7.1120174451787088E-2,5.9007338255357006E-2,1,0.20118368060784825,0.22792502992318189,0.72523276671560788,0.11124487485713534,0.14572608183307251]
[null,null,null,"Services professionels",7.6574257947384465,1.4349085706366707,1.963573691506582,0.52130172468975977,7.0400846005145679E-2,7.9399254565207938E-2,1,0.19317326689851605,0.30633681926866302,0.72015319754652163,0.11165245366273042,0.19561572321977766]
[null,null,null,"Gouvernement",4.3692686897507942,2.8829454702434698,1.6597640385352053,0.36561832360989571,0.1569957451229054,6.7209321864281815E-2,1,0.42842025404270623,0.25918541713368248,0.4881240751754603,0.24898401949870344,0.16530686447812867]
[]
[]
[null,null,null,null,"Emplois",null,null,"Revenus d'emploi",null,null,"Extrant",null,null,"Valeur ajoutée"]
[null,null,null,null,"Direct","Indirect","Induit","Direct","Indirect","Induit","Direct","Indirect","Induit","Direct","Indirect","Induit"]
[null,null,"Nunavut","Agriculture",1.0720000000000001,0.42799999999999994,0.106,6.0999999999999999E-2,2.3E-2,5.9999999999999993E-3,1,7.4999999999999997E-2,2.5999999999999999E-2,0.627,4.2999999999999997E-2,1.7000000000000001E-2]
[null,null,null,"Exploitation minière",1.5072967822316159,0.28213806622379051,0.3406351093389402,0.2059225944478171,2.3935785309876459E-2,1.9615928887154861E-2,1,7.5446155364831999E-2,8.1918290668393526E-2,0.56694343905190148,4.1151254589281115E-2,5.4520795550570225E-2]
[null,null,null,"Construction",1.3758980716276707,0.66218774179270123,0.29343227650941761,0.14145797436513025,6.6759297018024424E-2,1.6476511099268655E-2,1,0.16955957213705083,7.0569597148800858E-2,0.30874104150305709,9.3447120307786638E-2,4.7107512442928094E-2]
[null,null,null,"Secteur manufacturier",2.3896545583558084,1.7761099391435253,0.36338116941010384,0.19281966850248375,0.10579272112508256,2.0451389904054942E-2,0.9989354917418124,0.34698608426847027,8.742666788299655E-2,0.42162071620364389,0.1906327448466264,5.8349256299718523E-2]
[null,null,null,"Fabrication de produits métalliques",0,0,0,0,0,0,0,0,0,0,0,0]
[null,null,null,"Machinerie",0,0,0,0,0,0,0,0,0,0,0,0]
[null,null,null,"Équipements électriques",0,0,0,0,0,0,0,0,0,0,0,0]
[null,null,null,"TCSP",3.6723564349406828,0.73774062724370326,0.5939366536926769,0.35265158345440611,6.0421894281260935E-2,3.3873374798601363E-2,1,0.1742854078938425,0.14252796098343737,0.4498419660251764,9.4729190634703656E-2,9.5870716183580104E-2]
[null,null,null,"Commerce de gros",2.5504608683496262,0.37191062220558968,0.4268730371572243,0.25701531131980199,3.1109650520976681E-2,2.432130744173085E-2,1,8.7464547882023902E-2,0.10266548972808044,0.76492556450308646,4.6678651622271854E-2,6.8939927414340477E-2]
[null,null,null,"Commerce de détail",9.4366958296238685,0.82110085327239968,0.55970148623128024,0.33233533231916029,6.2337795645725572E-2,3.1601935380675204E-2,1,0.19204452847033351,0.13445386445114468,0.65069376248366317,0.10737587795299865,9.0335981868531368E-2]
[null,null,null,"FAI",1.3836490882918211,0.93115237219299873,0.21187336549906582,8.8625743927738226E-2,7.1389290513781081E-2,1.2154034233491198E-2,1,0.21059671291650434,5.1380536679740511E-2,0.72098666099104447,0.11734503807921308,3.4022996785093726E-2]
[null,null,null,"Services divers",4.5261259273739949,0.68321971793035208,0.51648547285708957,0.30980074408135516,5.7974110849275527E-2,2.920768527406124E-2,0.99959755310984444,0.19081043534599929,0.1240801107624902,0.67557916469559864,0.10057291566714549,8.3249910937058677E-2]
[null,null,null,"Services professionels",6.5055818541606385,0.59623046418417425,0.70375560248603541,0.4835400590092585,4.3410447390750277E-2,3.9773768173462926E-2,1,0.1521329958182609,0.16933494654134812,0.73091918245626775,9.5505195842377391E-2,0.11320784275541265]
[null,null,null,"Gouvernement",3.967747575035435,1.130156857621466,0.66141910568150042,0.40072858944789602,8.5041865237513975E-2,3.7080352544288465E-2,1,0.25145009019987824,0.15915079538654714,0.48818707743498208,0.13513588671844959,0.10673938906682763]
[]
[]
[null,null,null,null,"Emplois",null,null,"Revenus d'emploi",null,null,"Extrant",null,null,"Valeur ajoutée"]
[null,null,null,null,"Direct","Indirect","Induit","Direct","Indirect","Induit","Direct","Indirect","Induit","Direct","Indirect","Induit"]
[null,null,"Ontario","Agriculture",5.592289967761392,2.5278535398833273,1.1676441865348695,0.1702889004512857,0.14217090533153673,5.763525418800311E-2,1,0.53608102133942448,0.21218743641594401,0.45240221061225061,0.26937394643216134,0.12403489331428524]
[null,null,null,"Exploitation minière",2.3352522076431912,1.543239120933964,1.4018864288281339,0.24591966087595538,0.10776677546935555,6.9479978694643896E-2,1,0.32327515505099103,0.25445476587198884,0.61986678309851828,0.17603634060763351,0.14916560268912063]
[null,null,null,"Construction",4.0821038441454203,2.5373961394133886,1.7001650112340612,0.30128219750620366,0.163310003145896,8.4210575282923111E-2,1,0.50493648597208229,0.30851569300497689,0.46160214426882606,0.25215551344566456,0.18094317028775286]
[null,null,null,"Secteur manufacturier",1.6586236294982482,1.7995734678302315,0.93186945575713254,0.13776488987110724,0.11806609901725713,4.6201342787858896E-2,1,0.47731655274748186,0.16935580946459494,0.23274814786578704,0.20903315597982453,9.9235050849766041E-2]
[null,null,null,"Fabrication de produits métalliques",3.2553574650350323,2.0355100119898344,1.4578983035837718,0.25960092447050281,0.13720647129351965,7.2152542293882724E-2,1,0.51007241840969308,0.26470878246977669,0.38194144864784901,0.22395993805790521,0.15530508458776546]
[null,null,null,"Machinerie",3.4337259518356738,1.8863448283634321,1.5469910473801241,0.27135201624925404,0.13086957641494931,7.6558657797422769E-2,1,0.43886521825220876,0.28067086526305707,0.38533396726416586,0.20976561592545476,0.164514218148402]
[null,null,null,"Équipements électriques",3.2682416002988659,1.3797865055193066,1.3700848592261134,0.26987044760752116,9.2376728841273875E-2,6.7525101601880605E-2,1,0.30005268707937471,0.24836285290236651,0.38869964327243545,0.14848246503836202,0.14575720616025439]
[null,null,null,"TCSP",4.1380019199338811,2.6378875667695709,1.694218679267967,0.29521262930492748,0.15746886338600011,8.3795316925040594E-2,1,0.53810658941973011,0.3075272497299042,0.53500852608127214,0.26385593841203192,0.18035182100510641]
[null,null,null,"Commerce de gros",3.9288117844454549,2.59741040074953,1.8157554673127434,0.31022583448012553,0.1504299719444164,8.9745240843650542E-2,1,0.46436151983243223,0.32901522341648004,0.58499521030475876,0.2462742783351603,0.1930750200439906]
[null,null,null,"Commerce de détail",12.561516585558914,2.7045244184977979,2.360050062546196,0.43129807192970798,0.15890014042140321,0.11657075658403646,1,0.51686043115646552,0.42760996588147027,0.5800115962685628,0.28671281085317224,0.25104260501260922]
[null,null,null,"FAI",3.0701864622561303,2.9745802109015536,1.6227500731598656,0.24036389161121066,0.18921672878553983,8.0352253214653654E-2,1,0.52712086754914977,0.29437659719192605,0.54315342791902077,0.29747479127844928,0.17257601479522894]
[null,null,null,"Services divers",7.1432093580138618,1.9189081301318827,1.7666447682782942,0.3623986670840475,0.1065430380076081,8.7262718885268986E-2,1,0.30880661049636504,0.32006372442933062,0.6934003993312795,0.17270230297109918,0.1881428228425355]
[null,null,null,"Services professionels",5.7350496263974531,2.3801615764869184,2.3678039602713281,0.48116842131273474,0.13998988600212992,0.11720389048871992,1,0.39486942296429361,0.42898730374367039,0.63312020582712292,0.22355199596661124,0.25195183928218196]
[null,null,null,"Gouvernement",4.2881613786611767,2.9854168538618833,2.1188829782055021,0.39648021249371018,0.18702277478854459,0.10452691918321512,1,0.50259302230658121,0.38403479433389154,0.54639814666497311,0.30346627253829028,0.22546241663978017]
[]
[]
[null,null,null,null,"Emplois",null,null,"Revenus d'emploi",null,null,"Extrant",null,null,"Valeur ajoutée"]
[null,null,null,null,"Direct","Indirect","Induit","Direct","Indirect","Induit","Direct","Indirect","Induit","Direct","Indirect","Induit"]
[null,null,"Île-du-Prince-Édouard","Agriculture",5.3796566353975086,1.9791035945425299,0.7674284354661135,0.19312157037834399,8.5629936530984219E-2,2.8765642170761808E-2,1,0.31541093874064452,0.11582260177882286,0.49443434775053502,0.16656263621095557,7.5764331770831736E-2]
[null,null,null,"Exploitation minière",5.6362240349331296,0.38012400566024307,0.83171566541355102,0,1.8913415645857374E-2,3.0956707822928684E-2,1,7.0509355326525108E-2,0.12579796984033387,0.73275467766326252,3.8754677663262557E-2,8.1870123468786055E-2]
[null,null,null,"Construction",6.3248314654494147,1.5840870896229138,1.0464861802965721,0,7.2766339873419281E-2,3.897516451048022E-2,1,0.23337067033401365,0.1579231184354534,0.46158856965317918,0.1211052429835601,0.10313925535190653]
[null,null,null,"Secteur manufacturier",2.0002297450314148,2.7959424620521065,0.61405675723547959,0,0.11127922598814316,2.2999122019284821E-2,0.99996429102240947,0.50389737088198971,9.2526522884198548E-2,0.31096690532903221,0.25043104754091577,6.0384679795654324E-2]
[null,null,null,"Fabrication de produits métalliques",2.9312020154661234,0.98314853356153731,0.71425640112448874,0,5.0335569734753234E-2,2.7108278335979237E-2,1,0.19201073472681554,0.10765503737928318,0.36366443026524675,9.2893063504872711E-2,7.0659062901839001E-2]
[null,null,null,"Machinerie",5.3840416432316873,0.90467871909414077,1.0670998363934887,0,4.4445711681714892E-2,3.9403825212079829E-2,1,0.15079798203385844,0.16101845025277459,0.45041544151190221,7.9328750385903493E-2,0.10525410666226791]
[null,null,null,"Équipements électriques",2.6723409831233735,0.6522601561739878,0.62391530767579539,0,3.2302155035083623E-2,2.3029177679339551E-2,1,0.10690763475716591,9.4063688372661519E-2,0.65541101455660711,6.4652727969773172E-2,6.1627520338052889E-2]
[null,null,null,"TCSP",3.7527056566634549,1.6003559853588263,0.8179504251549945,0,7.1025683518423172E-2,3.0697367850886996E-2,1,0.24302220089100715,0.12335341638777048,0.47484306774542484,0.12910678434158041,8.0507955104087744E-2]
[null,null,null,"Commerce de gros",9.3563135836325309,1.3686583117280915,1.7263320713479018,0,6.4381891163347665E-2,6.4264109145407311E-2,1,0.19866077644387589,0.26012846937245743,0.60921472382351238,0.1166764058739027,0.17026350038678101]
[null,null,null,"Commerce de détail",13.126195087068309,1.668193774108913,1.4333377709540205,0,7.3695640705183266E-2,5.3540896371256412E-2,1,0.24311686974290925,0.21592540914816846,0.62608429367380525,0.13900645457115504,0.14140948486250729]
[null,null,null,"FAI",3.2918673620908647,2.1435446154069506,0.78355736088978389,0,9.9734298486368445E-2,2.9192015348676471E-2,1,0.31646553366872449,0.11806328227907843,0.54395385881139602,0.1791479932626627,7.7409851155167908E-2]
[null,null,null,"Services divers",8.7770222798369968,1.4007126060692705,1.2586752818874434,0,6.1046056307389705E-2,4.6949055393929434E-2,1,0.18440423813555931,0.18973471569432046,0.71470548452217519,0.10856185410490954,0.12393939568216379]
[null,null,null,"Services professionels",8.281107619998286,1.2421038264779491,1.5690755652002299,0,5.3252029346759384E-2,5.8355872166343081E-2,1,0.16525519140648015,0.23651232960837551,0.69457552087321783,9.8926364617570289E-2,0.15457988106090453]
[null,null,null,"Gouvernement",6.9114021920504722,2.130156460728998,1.6508693932730392,4.7535960343786298E-3,9.3807038537303697E-2,6.1322267220206853E-2,1,0.25444827605826409,0.24890774632360627,0.65100959009322057,0.1400575933976449,0.16285140115052765]
[]
[]
[null,null,null,null,"Emplois",null,null,"Revenus d'emploi",null,null,"Extrant",null,null,"Valeur ajoutée"]
[null,null,null,null,"Direct","Indirect","Induit","Direct","Indirect","Induit","Direct","Indirect","Induit","Direct","Indirect","Induit"]
[null,null,"Québec","Agriculture",3.4186953323688036,2.1090658495084114,0.78057062428942425,9.9231639315488868E-2,0.11565232837567734,3.2709794765452813E-2,1,0.47708855754233492,0.11695040640436398,0.54084462121214028,0.27846847353118415,7.0043820392984513E-2]
[null,null,null,"Exploitation minière",1.8962761028249804,1.2870204015121953,1.1299001050601125,0.2076373693008024,7.9411309190899629E-2,4.7851661109398869E-2,1,0.25783515310471583,0.16934683643807966,0.66324877051055986,0.13779465113017017,0.10121020324387382]
[null,null,null,"Construction",4.5382424886992245,3.1183605807181678,1.8317217579104317,0.32266387395760515,0.17406122274043431,7.6963988804985506E-2,1,0.54319381725782123,0.27455982856579375,0.44869070880892614,0.26455396617915833,0.16379930358705733]
[null,null,null,"Secteur manufacturier",2.5715991407497727,2.1861327248018174,1.0643014229969761,0.18225699625133898,0.11796624647088653,4.4937401239266539E-2,1,0.48563324034553002,0.15979323783556715,0.31174449878110189,0.21555869267085212,9.5274625577520922E-2]
[null,null,null,"Fabrication de produits métalliques",4.4496054386788471,2.3161048126772994,1.5681343051873706,0.2999317820706352,0.1391188487085486,6.5847397438662178E-2,1,0.50783123073605396,0.23571167180371896,0.37344022053383247,0.22659353331895671,0.1405253153895919]
[null,null,null,"Machinerie",4.4860331864577851,1.7719349570975031,1.5880329436951264,0.32524706843713941,0.10179395203958967,6.6910107043736886E-2,1,0.33365220440148108,0.23794817451327838,0.45839640267877457,0.16413104294183667,0.14198458317998514]
[null,null,null,"Équipements électriques",3.3000788398387804,1.5783274619272212,1.2964211991331775,0.2654272039390892,9.0269079020324702E-2,5.4636513710141457E-2,1,0.29366764746372415,0.19416065732013607,0.42386415511295195,0.14603650997556511,0.11601625791484758]
[null,null,null,"TCSP",4.4326619668590084,2.0401177693036776,1.4578581165266704,0.30479035883675826,0.1070049340662117,6.1424909435501628E-2,1,0.36124714339421726,0.21864541502197038,0.67295174165869842,0.17552381502311715,0.13033141198754655]
[null,null,null,"Commerce de gros",5.6975492257242806,2.325032319677717,1.9247622135108851,0.36938858531520496,0.12106218038586324,8.1051120985934158E-2,1,0.36190340656180503,0.2886045466690616,0.63485983552349745,0.19496584564782651,0.17251475265316607]
[null,null,null,"Commerce de détail",13.568562336815404,2.5838268595143803,2.2537139216630058,0.44110474952889883,0.13300524240017811,9.4945400212704659E-2,1,0.42681670108021208,0.33776808683966947,0.61548917656349134,0.23631905600921754,0.20157358610200651]
[null,null,null,"FAI",3.1475664071956082,3.4026834133313741,1.436774781944679,0.20594827314857728,0.18735852262108738,6.0480158741719969E-2,1,0.52441330474849612,0.21537774193140169,0.53217211725954194,0.29344584068018004,0.12862871679945373]
[null,null,null,"Services divers",9.1234080813065486,1.9871381545490352,1.8544261735574126,0.39523717317439866,9.6888822704666588E-2,7.816150918518823E-2,1,0.29115303459663078,0.27780282193804418,0.69984790844929556,0.16195088566824792,0.16602820976039931]
[null,null,null,"Services professionels",6.3745538186016457,2.598387292004857,2.2812433649391495,0.44899787515109718,0.13697848256989378,9.6243061323439266E-2,1,0.3818488714480413,0.34191291215490377,0.61666065671507952,0.21663912869211494,0.20427456216816023]
[null,null,null,"Gouvernement",4.4543194728926103,2.9400785227047512,1.9017571676465632,0.37501152494075923,0.16562459963932846,8.0248794581243482E-2,1,0.46124509494815097,0.2851584552294078,0.54852053248665833,0.29143229567604728,0.170317135077481]
[]
[]
[null,null,null,null,"Emplois",null,null,"Revenus d'emploi",null,null,"Extrant",null,null,"Valeur ajoutée"]
[null,null,null,null,"Direct","Indirect","Induit","Direct","Indirect","Induit","Direct","Indirect","Induit","Direct","Indirect","Induit"]
[null,null,"Saskatchewan","Agriculture",1.882779151329522,1.2836156378401582,0.28315714353057742,5.5863471402292079E-2,6.8950857368230728E-2,1.2386182846382753E-2,1,0.18230872228524458,5.0594276120831123E-2,0.45771787244029993,0.18230872228524458,3.2089654803524638E-2]
[null,null,null,"Exploitation minière",0.70135880990505084,0.86813145997398355,0.45124661802987304,9.8795763237348053E-2,6.3091649994122131E-2,1.9432634751993614E-2,1,0.14148481139581431,8.0109079479000145E-2,0.63262230865917513,0.14148481139581431,5.1681092176475193E-2]
[null,null,null,"Construction",3.1562711283086493,1.5492446772691399,0.89699576643834378,0.21808353930171703,0.1065144207561415,3.8599276304100254E-2,1,0.17841628384379138,0.15925012976961972,0.38174564575039555,0.17841628384379138,0.10307769224984417]
[null,null,null,"Secteur manufacturier",1.3174817256251092,1.8057976272434355,0.47223146791342874,8.8971966353817017E-2,9.0926998191841357E-2,2.051116595563587E-2,0.99995934348104953,0.33392190106679476,8.4023540180491282E-2,0.2254320650708998,0.33392190106679476,5.4388561007916149E-2]
[null,null,null,"Fabrication de produits métalliques",4.5528087850665155,1.1605752135109308,1.0950233571555585,0.34607007146667551,7.3929928533324474E-2,4.7E-2,1,0.13139489279998673,0.19400000000000001,0.41453503573333772,0.13139489279998673,0.126]
[null,null,null,"Machinerie",3.6447073939636159,1.3421292557155591,0.95540117660067991,0.27342708092608448,8.389396283058928E-2,4.1532028309261781E-2,0.99473433608769068,0.1396947867915676,0.16944188238609578,0.40441095488246764,0.1396947867915676,0.1100395046662412]
[null,null,null,"Équipements électriques",2.6384681248668924,0.68447135136871751,0.67862639481292186,0.22317167278158354,4.4113164143611411E-2,2.9261772830728949E-2,1,8.1172424857132983E-2,0.12058193383748093,0.35484837856271395,8.1172424857132983E-2,7.8475832525365982E-2]
[null,null,null,"TCSP",2.5727879563110361,1.4790828315619515,0.74199055799116365,0.18946560855721062,9.1843394469443923E-2,3.2011143046943663E-2,1,0.17094392376597026,0.13163877852635342,0.59449880029295787,0.17094392376597026,8.5408856161551999E-2]
[null,null,null,"Commerce de gros",4.0988375936054595,1.2352575982026219,1.0264405669477554,0.28461291793038834,7.742575241549042E-2,4.418580065805576E-2,1,0.14984145836698801,0.18190461800913857,0.62102524365115308,0.14984145836698801,0.11818673152033313]
[null,null,null,"Commerce de détail",11.211664051149011,1.5895293325078497,1.3528993805153984,0.39618015490469677,8.489135800494306E-2,5.8366812552759148E-2,1,0.17039144787304322,0.23958278348102222,0.65038238794453507,0.17039144787304322,0.1556533649230297]
[null,null,null,"FAI",2.875015915059286,2.5201372010270413,0.85119243386963461,0.18838051438265621,0.13432575664854807,3.6982355996524663E-2,1,0.24097565263363876,0.15077870794144541,0.53121309039847098,0.24097565263363876,9.8055132672702605E-2]
[null,null,null,"Services divers",7.787374247086376,1.2089546613879729,1.2013359302640447,0.38207003637121278,6.285252030239169E-2,5.1732231178643007E-2,1,0.1154942205698774,0.2129537393826556,0.73126491792323878,0.11392287194848957,0.13814651312068915]
[null,null,null,"Services professionels",6.1340080431651618,1.4523192416383006,1.289495560760697,0.40619157925291616,7.3829057756687119E-2,5.5753934332347738E-2,1,0.13448816627313037,0.22835099219408114,0.7056239702016307,0.13448816627313037,0.14823227852886472]
[null,null,null,"Gouvernement",5.2659519197289999,2.5560270943130909,1.3772283720931509,0.38106698568971969,0.14060865704664327,5.9616483641950088E-2,1,0.28041075422884271,0.24383316996133136,0.52447582707211615,0.26118074312317285,0.15854347433898586]
[]
[]
[null,null,null,null,"Emplois",null,null,"Revenus d'emploi",null,null,"Extrant",null,null,"Valeur ajoutée"]
[null,null,null,null,"Direct","Indirect","Induit","Direct","Indirect","Induit","Direct","Indirect","Induit","Direct","Indirect","Induit"]
[null,null,"Yukon","Agriculture",13.866336663185601,2.0103960590496923,0.45720729121338766,0.31963709221994152,9.3651305085370382E-2,2.4281803922693308E-2,1,0.26981955070719582,0.10522002729021736,0.46905323790733411,0.16015151886664189,7.3460011576773648E-2]
[null,null,null,"Exploitation minière",1.1192892886625876,1.1231497665468468,0.5031683834256736,0.17025053076274602,0.11492603176949594,2.656774056539063E-2,1,0.28585489121171581,0.11629743029739575,0.56464156757970041,0.1692634968489127,8.0614883901661646E-2]
[null,null,null,"Construction",2.8868098931210002,1.1184872636540206,0.56933483687096997,0.23974378211797817,8.1331203926905266E-2,3.0250274377048959E-2,1,0.21238637975088367,0.13126465291142164,0.43508809529188724,0.12220960534312325,9.1197434904468633E-2]
[null,null,null,"Secteur manufacturier",5.3498969585911098,1.2790957899594224,0.59293395061495457,0.35714587710507639,5.1617045876559742E-2,3.1520092531281227E-2,1,0.14853473421082614,0.13651381217389316,0.52691231927734083,9.3583078075069548E-2,9.5035791182352197E-2]
[null,null,null,"Fabrication de produits métalliques",0,0,0,0,0,0,0,0,0,0,0,0]
[null,null,null,"Machinerie",0,0,0,0,0,0,0,0,0,0,0,0]
[null,null,null,"Équipements électriques",6.0730000000000004,0.69699999999999995,0.95300000000000007,0.47099999999999997,4.1000000000000002E-2,5.0999999999999997E-2,1,0.11,0.219,0.67800000000000005,6.2E-2,0.153]
[null,null,null,"TCSP",3.9925561699178842,1.1580949828141471,0.78361874106084939,0.33695363647804483,7.7326755582854387E-2,4.1748394724514172E-2,1,0.24051798552535938,0.18013916973204883,0.51185651475715876,0.13620230660458024,0.12567720767758966]
[null,null,null,"Commerce de gros",4.6542888396786646,0.67327530619970755,0.95963479311633038,0.46129247392175049,4.7081385495151694E-2,5.1066911970723529E-2,1,0.13675578536030331,0.22108451374459134,0.7141002373379417,8.1883847864037157E-2,0.15362600292972739]
[null,null,null,"Commerce de détail",9.0641266310976487,1.1886084037021247,0.90293883108933115,0.40001927539710808,8.1518020801189667E-2,4.8094051577429769E-2,1,0.26435966892110135,0.20778855239021865,0.6289190589672421,0.15504818518843422,0.14459329558639583]
[null,null,null,"FAI",1.0643321994305492,1.565547078296126,0.36886549257612078,9.3473701088030631E-2,0.10755253518207741,1.9686944669279002E-2,1,0.34340823686570948,8.5016098172235946E-2,0.57215633280548783,0.19034693885539336,5.9344274989604685E-2]
[null,null,null,"Services divers",5.286666278179978,0.84771067161898994,0.61677722322875661,0.28741440109102578,5.6757298153703846E-2,3.2700021254302401E-2,1,0.16330100683594456,0.14188195420040867,0.73654982541344416,9.6626788244795134E-2,9.9051195580455581E-2]
[null,null,null,"Services professionels",8.3568315336004488,1.2861473451580907,1.1867171452576628,0.69212251326918806,8.9982514456597981E-2,6.3381137496267184E-2,1,0.22177058380444345,0.2733673475557975,0.67050775813064212,0.13865821379060567,0.19027723451884249]
[null,null,null,"Gouvernement",7.6971285940455205,1.3791448882803052,0.96829855173139756,0.45994125852308188,0.10058563341244804,5.1575663932021759E-2,1,0.2564191915804156,0.22327190211600009,0.58696648280367947,0.15615577884266313,0.15500554692046722]
[]
[]
[]
[null,null,null,null,0,0,0,0,0,0,0,0,0,0,0,0]
[null,null,null,null,0,0,0,0,0,0,0,0,0,0,0,0]
[null,null,null,null,0,0,0,0,0,0,0,0,0,0,0,0]
[null,null,null,null,0,0,0,0,0,0,0,0,0,0,0,0]
[null,null,null,null,0,0,0,0,0,0,0,0,0,0,0,0]
[null,null,null,null,0,0,0,0,0,0,0,0,0,0,0,0]
[null,null,null,null,0,0,0,0,0,0,0,0,0,0,0,0]
[null,null,null,null,0,0,0,0,0,0,0,0,0,0,0,0]
[null,null,null,null,0,0,0,0,0,0,0,0,0,0,0,0]
[null,null,null,null,0,0,0,0,0,0,0,0,0,0,0,0]
[null,null,null,null,0,0,0,0,0,0,0,0,0,0,0,0]
[null,null,null,null,0,0,0,0,0,0,0,0,0,0,0,0]
[null,null,null,null,0,0,0,0,0,0,0,0,0,0,0,0]
[null,null,null,null,0,0,0,0,0,0,0,0,0,0,0,0]
[]
[]
[null,null,null,null,"Emplois",null,null,"Revenus d'emploi",null,null,"Extrant",null,null,"Valeur ajoutée"]
[null,null,null,null,"Direct","Indirect","Induit","Direct","Indirect","Induit","Direct","Indirect","Induit","Direct","Indirect","Induit"]
[null,null,"MARÉGION","Agriculture",{"$f":"UM_JobsD","v":0},{"$f":"UM_JobsIndi","v":0},{"$f":"UM_JobsIndu","v":0},{"$f":"UM_EarningsD","v":0},{"$f":"UM_EarningsIndi","v":0},{"$f":"UM_EarningsIndu","v":0},{"$f":"UM_OutputD","v":0},{"$f":"UM_OutputIndi","v":0},{"$f":"UM_OutputIndu","v":0},{"$f":"UM_ValAddedD","v":0},{"$f":"UM_ValAddedIndi","v":0},{"$f":"UM_ValAddedIndu","v":0}]
[null,null,null,"Exploitation minière",0,0,0,0,0,0,0,0,0,0,0,0]
[null,null,null,"Construction",0,0,0,0,0,0,0,0,0,0,0,0]
[null,null,null,"Secteur manufacturier",0,0,0,0,0,0,0,0,0,0,0,0]
[null,null,null,"Fabrication de produits métalliques",0,0,0,0,0,0,0,0,0,0,0,0]
[null,null,null,"Machinerie",0,0,0,0,0,0,0,0,0,0,0,0]
[null,null,null,"Équipements électriques",0,0,0,0,0,0,0,0,0,0,0,0]
[null,null,null,"TCSP",0,0,0,0,0,0,0,0,0,0,0,0]
[null,null,null,"Commerce de gros",0,0,0,0,0,0,0,0,0,0,0,0]
[null,null,null,"Commerce de détail",0,0,0,0,0,0,0,0,0,0,0,0]
[null,null,null,"FAI",0,0,0,0,0,0,0,0,0,0,0,0]
[null,null,null,"Services divers",0,0,0,0,0,0,0,0,0,0,0,0]
[null,null,null,"Services professionels",0,0,0,0,0,0,0,0,0,0,0,0]
[null,null,null,"Gouvernement",0,0,0,0,0,0,0,0,0,0,0,0]

{"sheet":"Listes","index":10,"n_rows":28,"n_cols":7,"rows_kept":28,"cut":false,"hidden":false,"merged":[[0,0,16,1]]}
["*** AVERTISSEMENT ***\n\nCette feuille de calcul contient des données et des formules qui font partie intégrante du modèle EI2. \nBien que ces données et formules soient consultables pour examen, elles ne doivent pas être modifiées.\nToute modification des données ou des formules affectera l'analyse et pourrait invalider les résultats du modèle.\n\nPour les visualiser, faites simplement défiler les colonnes vers la droite."]
[null,null,"Année",null,"Provinces / Territoires",null,"Oui / Non"]
[null,null,2010,null,"Canada",null,"O"]
[null,null,2011,null,"Alberta",null,"N"]
[null,null,2012,null,"Colombie-Britannique"]
[null,null,2013,null,"Manitoba"]
[null,null,2014,null,"Nouveau-Brunswick"]
[null,null,2015,null,"Terre-Neuve-et-Labrador"]
[null,null,2016,null,"Territoires du Nord-Ouest"]
[null,null,2017,null,"Nouvelle-Écosse"]
[null,null,2018,null,"Nunavut"]
[null,null,2019,null,"Ontario"]
[null,null,2020,null,"Île-du-Prince-Édouard"]
[null,null,2021,null,"Québec"]
[null,null,2022,null,"Saskatchewan"]
[null,null,2023,null,"Yukon"]
[null,null,2024,null,"MARÉGION"]
[null,null,2025]
[null,null,2026]
[null,null,2027]
[null,null,2028]
[null,null,2029]
[null,null,2030]
[null,null,2031]
[null,null,2032]
[null,null,2033]
[null,null,2034]
[null,null,2035]