{"text_format":"1","workbook":"xlsx","n_sheets":11,"sheets":["À PROPOS EI2","FAQ","COMMENCER","DonnéesProjet","Résultats","RégionPersonnalisée","DonnéesParDéfaut","Calculs","Déflateurs","Multiplicateurs","Listes"],"not_rendered":{"charts":4,"images":0,"macros":1,"external_links":0,"defined_names":142,"comments":5,"pivot_tables":0},"unopened":[],"bounds":{"document_bytes":16777216,"sheet_cells":100000,"rows_first":2000,"rows_last":500,"rows_between":2000,"halvings":0,"cell_chars":16384,"cell_head_chars":4096},"cells_cut":0,"cells_raw":0,"read":"whole","date_system":"1900"}

{"sheet":"À PROPOS EI2","index":0,"n_rows":24,"n_cols":2,"rows_kept":24,"cut":false,"hidden":false,"merged":[[7,1,11,1]]}
[null,"EI2 - ÉOLIEN"]
[]
[null,"Modèle Impacts Économiques des Initiatives d'Électrification (EI2) "]
[]
[]
[null,"Numéro de version: e-2021-10-22"]
[]
[null,"   Les modèles « Impacts économiques des initiatives d’électrification » (EI2) reprennent la structure du modèle Jobs and Economic Development Impact (JEDI) élaboré en 2002 pour montrer les avantages économiques du développement de centrales éoliennes terrestres aux États-Unis.\n\nCe modèle a été adapté à l’échelle des provinces et territoritoires canadiens avec pour premier objectif de fournir aux promoteurs d’éoliennes, aux défenseurs des énergies renouvelables, aux responsables gouvernementaux, aux décideurs et autres utilisateurs potentiels un outil pour déterminer les retombées économiques locales de la construction et de l’exploitation de centrales éoliennes. Le second objectif est de faciliter l’accès au modèle et son utilisation à grande échelle.\n"]
[]
[]
{"$rows_left_out":15}
{"sheet":"FAQ","index":1,"n_rows":60,"n_cols":2,"rows_kept":60,"cut":false,"hidden":false,"merged":[]}
[]
[null,"EI2 - ÉOLIEN"]
[]
[null,"Modèle Impacts Économiques des Initiatives d'Électrification (EI2) "]
[]
[null,"Foire aux questions (FAQ)"]
[]
[]
[null,"Comment savoir si je dispose de la version la plus récente du modèle EI2 ?"]
[null,"La version la plus récente du modèle est disponible sur le site web de l'initiative de modélisation énergétique à l'adresse https://emi-ime.ca/.  "]
{"$rows_left_out":51}
{"sheet":"COMMENCER","index":2,"n_rows":4,"n_cols":2,"rows_kept":4,"cut":false,"hidden":false,"merged":[]}
[]
[]
[null,"EI2 - ÉOLIEN"]
[null,"Modèle Impacts Économiques des Initiatives d'Électrification (EI2) "]

{"sheet":"DonnéesProjet","index":3,"n_rows":118,"n_cols":36,"rows_kept":118,"cut":false,"hidden":false,"merged":[[19,0,20,0],[2,0,2,8],[84,0,84,5],[22,0,22,2],[23,0,23,5],[61,0,61,5],[24,0,24,5]]}
[" EI2 - ÉOLIEN"]
["Données sur le projet de parc éolien"]
["INSTRUCTIONS :\n   1. Commencez par saisir la localisation du projet (dans la liste déroulante) et autres données descriptives. Après avoir saisi des données, appuyez sur la touche «Entrée» (ou passez à la case suivante) pour continuer. Si vous réalisez une analyse d'une région personnalisée, complétez d'abord la feuille de calcul «RégionPersonnalisée», puis sélectionner «MARÉGION» comme localisation du projet.\n   2. Une fois les données descriptives saisies, choisissez « O » ou « N » à la ligne 20 pour continuer. Choisissez « O » pour accepter les valeurs par défaut des coûts du projet et de la part locale ou « N » pour vérifier ou modifier ces valeurs.\n   3. Une fois toutes les valeurs déterminées, cliquez sur le bouton « Aller aux résultats ».\n\nPour appliquer les nouvelles valeurs dans l'analyse, vous devez répondre « N » à la question « Utiliser les valeurs par défaut du modèle (ci-dessous) ? » – Ligne 20.\nVous pouvez obtenir des informations supplémentaires en plaçant le curseur sur les triangles rouges situés dans les coins des cellules et dans l'onglet FAQ.\nSeules les cellules à fond blanc peuvent être modifiées (et accepter de nouvelles valeurs).\n"]
[]
[]
["Données descriptives du projet"]
["Description du projet"]
["Nom du projet","Projet 1",{"$f":"IF(B9=\"MARÉGION\",IF(RégionPersonnalisée!E23=0,\"   **Erreur - Absence de multiplicateurs régionaux  dans l'onglet Région personnalisée**\",\"\"),\"\")","v":""}]
["Localisation du projet","Alberta",{"$f":"IF(B9=\"MARÉGION\",IF(RégionPersonnalisée!E23<>0,\"\",\"   Entrer la taille de la population de la région\"),\"\")","v":""},null,null,null,null,null,null,null,null,null,null,null,null,null,null,null,null,null,null,null,null,null,null,null,{"$f":"IF(B9=\"MARÉGION\",IF(B10=\"\",2,1),0)","v":0}]
[{"$f":"IF(B9=\"MARÉGION\",\"Population (Requis seulement si analyse d'une région personnalisée)\",\"\")","v":""},null,{"$f":"IF($C9=\"\",\"\",IF($B10<1,\"   **Erreur - Les données sur la population sont manquantes**\",\"\"))","v":""}]
{"$rows_left_out":109}
{"sheet":"Résultats","index":4,"n_rows":144,"n_cols":37,"rows_kept":144,"cut":false,"hidden":false,"merged":[[40,0,40,4]]}
[" EI2 - ÉOLIEN"]
[{"$f":"CONCATENATE(\"Parc éolien - Résumé des données du projet sur la base des valeurs \",$AE$5)","v":"Parc éolien - Résumé des données du projet sur la base des valeurs par défaut du modèle"}]
["Localisation du projet",null,{"$f":"IF(DonnéesProjet!B9=\"MARÉGION\",RégionPersonnalisée!B4,DonnéesProjet!B9)","v":"Alberta"},null,null,null,null,null,null,null,null,null,null,null,null,null,null,null,null,null,null,null,null,null,null,null,null,null,null,null,{"$f":"D9+D10","v":2050.5204567452565},{"$f":"DonnéesProjet!B20","v":"O"}]
["Année de construction",null,{"$f":"DonnéesProjet!B15","v":2022},null,null,null,null,null,null,null,null,null,null,null,null,null,null,null,null,null,null,null,null,null,null,null,null,null,null,null,{"$f":"DonnéesParDéfaut!E46+DonnéesParDéfaut!E80","v":2050.520456745257}]
["Puissance totale du projet - Puissance installée (MW)",null,{"$f":"DonnéesProjet!B11","v":100},null,null,null,null,null,null,null,null,null,null,null,null,null,null,null,null,null,null,null,null,null,null,null,null,null,null,null,{"$f":"IF(AND(AE3=AE4,AF3=\"O\"),\"par défaut du modèle\",\"révisées par l'utilisateur\")","v":"par défaut du modèle"}]
[]
["Puissance d'une éolienne (kW)",null,{"$f":"DonnéesProjet!B12","v":2500},null,null,null,null,null,null,null,null,null,null,null,null,null,null,null,null,null,null,null,null,null,null,null,null,null,null,null,{"$f":"CONCATENATE(\"EI2-ÉOLIEN_\",DonnéesProjet!B8)","v":"EI2-ÉOLIEN_Projet 1"}]
["Nombre d'éoliennes",null,{"$f":"DonnéesProjet!B13","v":40}]
["Coûts d'installation du projet ($/kW)",null,{"$f":"Calculs!D37/(C5*1000)","v":2025.5204567452568},{"$f":"DonnéesProjet!C57","v":2025.5204567452568},"sans taxes"]
["Coûts annuels d'exploitation et d'entretien ($/kW)",null,{"$f":"Calculs!D93","v":25},{"$f":"DonnéesProjet!C69+DonnéesProjet!C79","v":25},"sans taxes"]
{"$rows_left_out":135}
{"sheet":"RégionPersonnalisée","index":5,"n_rows":209,"n_cols":6,"rows_kept":209,"cut":false,"hidden":false,"merged":[[1,0,1,4],[6,4,7,5]]}
["Multiplicateurs pour analyse Input-Output d'une région personnalisée"]
["Utilisez cette feuille de calcul lorsque vous effectuez une analyse de région personnalisée (sélectionnez \"MAREGION\" dans la feuille de calcul des données du projet).\n1. Entrez le nom de la région, l'année des multiplicateurs et la province ou le territoire où la région est située.\n2. Entrez les multiplicateurs et le modèle de dépenses de consommation personnelle de cette région.\n3. Enfin, vous pouvez revenir à la feuille de calcul données du projet pour mettre à jour les différentes valeurs."]
[]
["MARÉGION (Nom)",null,"Année des données",null,""]
["Province ou Territoire (Nom)","Canada"]
[]
["Multiplicateurs directs d'emplois ",null,null,null,"Dépenses personnelles de consommation (DPC)"]
["Emplois par million de dollars de production"]
["Agriculture",0,null,null,0]
["Exploitation minière",0,null,null,0]
{"$rows_left_out":200}
{"sheet":"DonnéesParDéfaut","index":6,"n_rows":158,"n_cols":48,"rows_kept":158,"cut":false,"hidden":false,"merged":[[0,0,16,1]]}
["*** AVERTISSEMENT ***\n\nCette feuille de calcul contient des données et des formules qui font partie intégrante du modèle EI2. \nBien que ces données et formules soient consultables pour examen, elles ne doivent pas être modifiées.\nToute modification des données ou des formules affectera l'analyse et pourrait invalider les résultats du modèle.\n\nPour les visualiser, faites simplement défiler les colonnes vers la droite.",null,null,null,null,null,null,null,null,null,null,null,null,null,null,null,null,null,"Changement annuel moyen"]
[null,null,null,null,null,null,null,null,null,null,"Défaut",null,null,null,null,null,null,null,-0.01]
[null,null,null,null,null,null,null,"Const Emplois/",{"$f":"E5","v":100},"O&M Emplois/",{"$f":"E5","v":100},"MW",null,null,"Coût moyen du projet (construction / installation) par kW",null,null,{"$f":"IF(Year_of_Construction<O4,O5,HLOOKUP(Year_of_Construction,O4:AH5,2,FALSE))","v":1999.8}]
[null,null,null,"Nombre de turbines","MW","Total Installed Cost",null,"Fondation",{"$f":"I$3*AM30","v":22.825865950493196},"Tech. Terrain",{"$f":"K$3*AP56","v":4},null,null,null,2016,2017,2018,2019,2020,2021,2022,2023,2024,2025,{"$f":"X4+1","v":2026},2027,2028,2029,2030,2031,2032,2033,2034,2035,2036,2037,2038,2039,2040]
[null,null,null,{"$f":"ROUNDUP(DonnéesProjet!B11*1000/DonnéesProjet!B12,0)","v":40},{"$f":"DonnéesProjet!B11","v":100},{"$f":"R8","v":2025.2762431107647},null,"Édification",{"$f":"I$3*AM31","v":22.825865950493196},"Admin",{"$f":"K$3*AP57","v":1},null,null,null,2020,2020,2020,2020,2020,2020,{"$f":"T5*(1+$S2)","v":1999.8},1979.8019999999999,1960.00398,1940.4039401999999,1920.9999007979998,1901.7899017900197,1882.7720027721195,1863.9442827443984,1845.3048399169543,1827,1827,1827,1827,1827,1827,1827,1827,1827,1827]
[null,null,null,null,null,null,null,"Électricité",25.108452545542516,"Gestion",{"$f":"K$3*AP58","v":1}]
[null,null,null,"Construction",null," User",null,"Gestion / Encadrement",14.239815553471088,"Total",{"$f":"SUM(K4:K6)","v":6},null,null,null,null,null,"Ajustement loc. const.",{"$f":"VLOOKUP(DonnéesProjet!B9,Multiplicateurs!S8:T22,2,FALSE)","v":1.0979511095684147},null,null,null,null,null,null,null,null,null,null,null,null,null,null,null,null,null,null,"Taille moyenne turbine (kW)",null,null,"Ajustement coût O&M"]
[null,null,null,"Coût par kW","Coût du projet","Coût O&M","Coût O&M par défaut","kW par turbine",{"$f":"SUM(I4:I7)","v":85},null,null,null,null,null,null,null,"Coût de construction / installation ajusté (par kW)",{"$f":"Y46","v":2025.2762431107647},null,null,null,null,null,null,null,null,null,null,null,null,null,null,null,null,null,null,null,1500,null,"<=20 MW",{"$f":"25+Z119","v":25.500472895138206},"par KW"]
[null,null,null,{"$f":"DonnéesProjet!B18","v":2025.2762431107647},{"$f":"D9*DonnéesProjet!B11*1000","v":202527624.31107646},{"$f":"DonnéesProjet!B19","v":25},25,{"$f":"DonnéesProjet!B12","v":2500},null,null,null,null,null,null,null,null,null,null,null,null,null,null,null,null,null,null,null,null,null,null,null,null,null,null,null,null,null,null,null,"100 MW",{"$f":"20+Z119","v":20.500472895138206},"par KW"]
[]
{"$rows_left_out":149}
{"sheet":"Calculs","index":7,"n_rows":233,"n_cols":37,"rows_kept":233,"cut":false,"hidden":false,"merged":[[39,12,39,23],[31,12,31,23],[0,0,16,1]]}
["*** AVERTISSEMENT ***\n\nCette feuille de calcul contient des données et des formules qui font partie intégrante du modèle EI2. \nBien que ces données et formules soient consultables pour examen, elles ne doivent pas être modifiées.\nToute modification des données ou des formules affectera l'analyse et pourrait invalider les résultats du modèle.\n\nPour les visualiser, faites simplement défiler les colonnes vers la droite.",null,"Analyse d'iimpacts économiques pour ",null,{"$f":"DonnéesProjet!B9","v":"Alberta"},"centrale éolienne"]
[]
[null,null,"Coûts de construction du projet"]
[null,null,null,"Coût","Part locale",null,"Dépenses locales",null,null,null,null,null,null,null,null,null,null,null,null,null,null,null,null,null,null,null,null,"Coûts de construction du projet","Coût","Part locale"]
[null,null,"Systèmes Auxilliaires",null,null,null,null,null,null,null,null,null,null,null,null,null,null,null,null,null,null,null,null,null,null,null,null,"Systèmes Auxilliaires"]
[null,null,"Matériaux",null,null,null,null,null,null,null,null,null,null,null,null,null,null,null,null,null,null,null,null,null,null,null,null,"Matériaux"]
[null,null,"Construction (béton, armature, équipement, voies d'accès et préparation du site)",{"$f":"IF(DonnéesProjet!$B$20=\"O\",DonnéesParDéfaut!D18,DonnéesProjet!B35)","v":21804406.524476796},{"$f":"IF(DonnéesProjet!$B$20=\"O\",IF(DonnéesProjet!AA$9=0,DonnéesParDéfaut!G18,DonnéesProjet!AA35),DonnéesProjet!E35)","v":0.9},null,{"$f":"D7*E7","v":19623965.872029118},null,null,null,null,null,null,null,null,null,null,null,null,null,null,null,null,null,null,null,null,"Construction (béton, armature, équipement, voies d'accès et préparation du site)",{"$f":"D7","v":21804406.524476796},0.9]
[null,null,"Transformateur",{"$f":"IF(DonnéesProjet!$B$20=\"O\",DonnéesParDéfaut!D19,DonnéesProjet!B36)","v":2466530.4197062631},{"$f":"IF(DonnéesProjet!$B$20=\"O\",IF(DonnéesProjet!AA$9=0,DonnéesParDéfaut!G19,DonnéesProjet!AA36),DonnéesProjet!E36)","v":0},null,{"$f":"D8*E8","v":0},null,null,null,null,null,null,null,null,null,null,null,null,null,null,null,null,null,null,null,null,"Transformateur",2466530.4197062631,0]
[null,null,"Électricité (câble de dérivation, fil)\n",{"$f":"IF(DonnéesProjet!$B$20=\"O\",DonnéesParDéfaut!D20,DonnéesProjet!B37)","v":2599889.7286412967},{"$f":"IF(DonnéesProjet!$B$20=\"O\",IF(DonnéesProjet!AA$9=0,DonnéesParDéfaut!G20,DonnéesProjet!AA37),DonnéesProjet!E37)","v":1},null,{"$f":"D9*E9","v":2599889.7286412967},null,null,null,null,null,null,null,null,null,null,null,null,null,null,null,null,null,null,null,null,"Électricité (câble de dérivation, fil)\n",2599889.7286412967,1]
[null,null,"Prolongement de la ligne HT",{"$f":"IF(DonnéesProjet!$B$20=\"O\",DonnéesParDéfaut!D21,DonnéesProjet!B38)","v":4749131.1675761305},{"$f":"IF(DonnéesProjet!$B$20=\"O\",IF(DonnéesProjet!AA$9=0,DonnéesParDéfaut!G21,DonnéesProjet!AA38),DonnéesProjet!E38)","v":0.7},null,{"$f":"D10*E10","v":3324391.8173032911},null,null,null,null,null,null,null,null,null,null,null,null,null,null,null,null,null,null,null,null,"Prolongement de la ligne HT",4749131.1675761305,0.7]
{"$rows_left_out":224}
{"sheet":"Déflateurs","index":8,"n_rows":60,"n_cols":49,"rows_kept":60,"cut":false,"hidden":false,"merged":[[0,0,16,1]]}
["*** AVERTISSEMENT ***\n\nCette feuille de calcul contient des données et des formules qui font partie intégrante du modèle EI2. \nBien que ces données et formules soient consultables pour examen, elles ne doivent pas être modifiées.\nToute modification des données ou des formules affectera l'analyse et pourrait invalider les résultats du modèle.\n\nPour les visualiser, faites simplement défiler les colonnes vers la droite.",null,"Déflateurs / Inflateurs"]
[null,null,"Pour assurer la consistance entre les multiplicateurs et les données projet"]
[]
[null,null,"Année des multiplicateurs",null,{"$f":"IF(DonnéesProjet!B9=\"MARÉGION\",RégionPersonnalisée!D4,Multiplicateurs!C63)","v":2017},null,null,null,"Déflateur",{"$f":"HLOOKUP($E$5,D9:AW51,$D$60)","v":0.94890510948905105}]
[null,null,"Dollars de l'année",null,{"$f":"DonnéesProjet!B16","v":2020},null,null,null,"Inflateur",{"$f":"HLOOKUP($E$5,D9:AW51,$D$59)","v":1.0538461538461539}]
[]
[]
[]
[null,null,null,2005,2006,2007,2008,2009,2010,2011,2012,2013,2014,2015,2016,2017,2018,2019,2020,2021,2022,2023,2024,2025,2026,2027,2028,2029,2030,2031,2032,2033,2034,2035,2036,2037,2038,2039,2040,2041,2042,2043,2044,2045,2046,2047,2048,2049,2050]
[null,null,2005,1,1.0186915887850467,1.0467289719626169,1.0654205607476634,1.0654205607476634,1.0934579439252334,1.1214953271028036,1.1401869158878504,1.1495327102803738,1.1682242990654206,1.1869158878504673,1.1962616822429906,1.2149532710280373,1.2429906542056075,1.2710280373831775,1.280373831775701,1.2990654205607475,1.3271028037383177,1.3457943925233644,1.3738317757009344,1.3925233644859811,1.4205607476635513,1.4485981308411215,1.485981308411215,1.514018691588785,1.5514018691588782,1.5794392523364484,1.6168224299065419,1.6542056074766354,1.6822429906542056,1.719626168224299,1.7570093457943923,1.7943925233644857,1.8224299065420559,1.8598130841121494,1.8971962616822426,1.9345794392523361,1.9813084112149533,2.018691588785047,2.0560747663551404,2.1028037383177569,2.1495327102803734,2.1869158878504669,2.2336448598130842,2.2803738317757007,2.3364485981308412]
{"$rows_left_out":51}
{"sheet":"Multiplicateurs","index":9,"n_rows":348,"n_cols":26,"rows_kept":348,"cut":false,"hidden":false,"merged":[[0,0,16,1]]}
["*** AVERTISSEMENT ***\n\nCette feuille de calcul contient des données et des formules qui font partie intégrante du modèle EI2. \nBien que ces données et formules soient consultables pour examen, elles ne doivent pas être modifiées.\nToute modification des données ou des formules affectera l'analyse et pourrait invalider les résultats du modèle.\n\nPour les visualiser, faites simplement défiler les colonnes vers la droite.",null,{"$f":"DonnéesProjet!B9","v":"Alberta"}]
[]
[]
[]
[null,null,"Multiplicateurs"]
[null,null,null,"Emplois",null,null,"Revenus d'emploi",null,null,"Extrant",null,null,"Valeur ajoutée"]
[null,null,null,"Direct","Indirect","Induit","Direct","Indirect","Induit","Direct","Indirect","Induit","Direct","Indirect","Induit",null,null,null,null,"Facteurs salaires","Impôts sur le revenu",null,null,"CPP + EI",6.83E-2]
[null,null,"Agriculture",{"$f":"IF(C1=D44,M_CA,IF(C1=E44,M_AB,IF(C1=F44,M_BC,IF(C1=G44,M_MB,IF(C1=H44,M_NB,IF(C1=I44,M_NL,IF(C1=J44,M_NT,IF(C1=K44,M_NS,IF(C1=L44,M_NU,IF(C1=M44,M_ON,IF(C1=N44,M_PE,IF(C1=O44,M_QC,IF(C1=P44,M_SK,IF(C1=Q44,M_YK,IF(C1=R44,M_MR,M_0)))))))))))))))","v":2.2940527386729013},1.9750425956620221,0.51593913894350463,7.3079135790848945E-2,0.11875997599486887,2.6173647953961796E-2,1,0.58751951493484034,0.10204619543906382,0.46211098090700664,0.2596545939896881,6.3120526123851203E-2,null,null,null,"Canada",1,0.16,null,null,"QPP + EI",7.4800000000000005E-2,"Québec"]
[null,null,"Exploitation minière",0.71394416125850468,1.6609846845741649,0.80523819342035574,0.13324700193082645,0.13721989990211844,4.0238380504414424E-2,1,0.4175383696517434,0.15862860272277921,0.54165475734401591,0.23363132532224554,9.8136950424575098E-2,null,null,null,"Alberta",1.0979511095684147,0.27]
[null,null,"Construction",3.4865808507104501,2.0789526318639258,1.3563346242124157,0.29457007747499669,0.16104352236118666,6.757569946374041E-2,1,0.49737581426511562,0.26628433052620709,0.41023870108301225,0.27109394040776225,0.16546476799882354,null,null,null,"Colombie-Britannique",0.98469163777502611,0.22]
{"$rows_left_out":339}
{"sheet":"Listes","index":10,"n_rows":28,"n_cols":7,"rows_kept":28,"cut":false,"hidden":false,"merged":[[0,0,16,1]]}
["*** AVERTISSEMENT ***\n\nCette feuille de calcul contient des données et des formules qui font partie intégrante du modèle EI2. \nBien que ces données et formules soient consultables pour examen, elles ne doivent pas être modifiées.\nToute modification des données ou des formules affectera l'analyse et pourrait invalider les résultats du modèle.\n\nPour les visualiser, faites simplement défiler les colonnes vers la droite."]
[null,null,"Année",null,"Provinces / Territoires",null,"Oui / Non"]
[null,null,2010,null,"Canada",null,"O"]
[null,null,2011,null,"Alberta",null,"N"]
[null,null,2012,null,"Colombie-Britannique"]
[null,null,2013,null,"Manitoba"]
[null,null,2014,null,"Nouveau-Brunswick"]
[null,null,2015,null,"Terre-Neuve-et-Labrador"]
[null,null,2016,null,"Territoires du Nord-Ouest"]
[null,null,2017,null,"Nouvelle-Écosse"]
{"$rows_left_out":18}