{"text_format":"1","workbook":"xlsx","n_sheets":11,"sheets":["About EI2","FAQ","START","ProjectData","SummaryResults","User Add-in Location","DefaultData","Calculations","Deflators","Multipliers","Lists"],"not_rendered":{"charts":4,"images":0,"macros":1,"external_links":0,"defined_names":65,"comments":3,"pivot_tables":0},"unopened":[],"bounds":{"document_bytes":16777216,"sheet_cells":100000,"rows_first":2000,"rows_last":500,"rows_between":2000,"halvings":0,"cell_chars":16384,"cell_head_chars":4096},"cells_cut":0,"cells_raw":0,"read":"whole","date_system":"1900"}

{"sheet":"About EI2","index":0,"n_rows":23,"n_cols":2,"rows_kept":23,"cut":false,"hidden":false,"merged":[[7,1,11,1]]}
[null,"EI2 - ThermalComfortR"]
[]
[null,"Economic Impacts of Electrification Initiatives (EI2) Model "]
[]
[]
[null,"Release Number: tcr-2021-10-22"]
[]
[null,"   The Economic Impacts of Electrification Initiatives (EI2) Model use a similar structure as the Jobs and Economic Development Impact (JEDI) Model that was initially developed in 2002 to demonstrate the economic benefits associated with developing land-based wind power plants in the United States.  \n\nThe primary goal in developing the Canadian provincial / territorial level model is to provide a tool for government officials, decision makers and other potential users, to easily identify the local economic impacts associated with energy efficiency measures such as installing thermal comfort technologies. The second goal was to facilitate broad access and usage of the model. "]
[]
[]
{"$rows_left_out":14}
{"sheet":"FAQ","index":1,"n_rows":60,"n_cols":2,"rows_kept":60,"cut":false,"hidden":false,"merged":[]}
[]
[null,"EI2 - ThermalComfortR"]
[]
[null,"Economic Impacts of Electrification Initiatives (EI2) Model "]
[]
[null,"Frequently Asked Questions (FAQ)"]
[]
[]
[null,"How do I know if I have the most current version of the EI2 model?"]
[null,"The most current version of the EI2 model is available on the Energy Modelling initiative web site at https://emi-ime.ca/.  "]
{"$rows_left_out":51}
{"sheet":"START","index":2,"n_rows":4,"n_cols":2,"rows_kept":4,"cut":false,"hidden":false,"merged":[]}
[]
[]
[null,"EI2 - ThermalComfortR"]
[null,"Economic Impacts of Electrification Initiatives (EI2) Model "]

{"sheet":"ProjectData","index":3,"n_rows":51,"n_cols":36,"rows_kept":51,"cut":false,"hidden":false,"merged":[[43,0,43,5],[2,0,2,5],[23,0,23,2],[24,0,24,5],[34,0,34,5],[25,0,25,5]]}
["EI2 - Thermal Comfort Residential (EI2-TCR)"]
[]
["INSTRUCTIONS:      \n   1. Begin by entering Project Location (from pull-down list) and other Descriptive Data.  \t\t\t\t\t\n   2. After inserting required data press enter (or cursor to the next cell) to continue.\t\t\t\t\t\n   3. Once Descriptive Data is complete, choose \"Y\" or \"N\" on Line 20 to continue.\t\t\t\t\t\n   4. Choose \"Y\" to accept Project Cost and Local Share defaults or \"N\" to review/modify values.\n   5. Once all values are entered, click the \"Go to Summary Impacts\" button.\n\t\t\t\t\t\nTo utilize new values in analysis you must choose an \"N\" in \"Utilize Model Default Values (below)?\" - Line 21\t\t\nAdditional information is available by pointing to the red triangles located in cell corners and in the FAQ tab.\t\t\t\t\t\nOnly those cells with a white background can be changed (accept new values).  \t"]
[]
[]
["Project Descriptive Data"]
["Project Description"]
["Project Name ","Project 1",{"$f":"IF(B9=\"MYREGION\",IF('User Add-in Location'!E22=0,\"   Error - No Regional multiplier data in User Add-in Location\",\"\"),\"\")","v":""}]
["Project Location","Alberta",{"$f":"IF(B9=\"MYREGION\",IF('User Add-in Location'!E22=0,\"\",\"          Enter Region Population\"),\"\")","v":""},null,null,null,null,null,null,null,null,null,null,null,null,null,null,null,null,null,null,null,null,null,null,null,{"$f":"IF(B9=\"MYREGION\",IF(B10=\"\",2,1),0)","v":0}]
[null,null,{"$f":"IF($C9=\"\",\"\",IF($B10<1,\"      **Error - Population Data Missing**\",\"\"))","v":""}]
{"$rows_left_out":42}
{"sheet":"SummaryResults","index":4,"n_rows":38,"n_cols":37,"rows_kept":38,"cut":false,"hidden":false,"merged":[[36,0,36,4]]}
["EI2 - TCR"]
[{"$f":"CONCATENATE(\"Thermal comfort measures - Project Data Summary based on \",$AE$5, \" values\")","v":"Thermal comfort measures - Project Data Summary based on Model Default Data values"}]
["Project Location",null,{"$f":"IF(ProjectData!B9=\"MyCounty\",'User Add-in Location'!#REF!,ProjectData!B9)","v":"Alberta"},null,null,null,null,null,null,null,null,null,null,null,null,null,null,null,null,null,null,null,null,null,null,null,null,null,null,null,{"$f":"D7+D8","v":18506.16},{"$f":"ProjectData!B21","v":"Y"}]
["Year of Construction ",null,{"$f":"ProjectData!B16","v":2022},null,null,null,null,null,null,null,null,null,null,null,null,null,null,null,null,null,null,null,null,null,null,null,null,null,null,null,{"$f":"DefaultData!F7+DefaultData!G7","v":18506.16}]
["Number of installations",null,{"$f":"ProjectData!B12","v":12000},null,null,null,null,null,null,null,null,null,null,null,null,null,null,null,null,null,null,null,null,null,null,null,null,null,null,null,{"$f":"IF(AND(ROUND(AE3,2)=ROUND(AE4,2),AF3=\"Y\"),\"Model Default Data\",\"User Data\")","v":"Model Default Data"}]
[]
["Installed Cost ($/technology)",null,{"$f":"Calculations!D11/SummaryResults!C5","v":18276.16},{"$f":"ProjectData!B19","v":18276.16},"without taxes",null,null,null,null,null,null,null,null,null,null,null,null,null,null,null,null,null,null,null,null,null,null,null,null,null,{"$f":"_xlfn.CONCAT(\"EI2-TCR_\",ProjectData!B8)","v":"EI2-TCR_Project 1"}]
["Maintenance Cost ($/technology)",null,{"$f":"Calculations!D18/SummaryResults!C5","v":230},{"$f":"ProjectData!B20","v":230},"without taxes"]
["Money Value (Dollar Year)",null,{"$f":"ProjectData!B17","v":2020}]
["Total Installed Project Cost",null,{"$f":"Calculations!D11","v":219313920}]
{"$rows_left_out":29}
{"sheet":"User Add-in Location","index":5,"n_rows":208,"n_cols":6,"rows_kept":208,"cut":false,"hidden":true,"merged":[]}
["Multipliers For Economic Input-Output Analysis"]
[]
["MYREGION (Name)",null,"Year of Data",null,""]
["Province or Territory (Name)"]
[]
["Jobs Direct Multipliers",null,null,null,"Personal Consumption Expenditures (PCE)"]
["Jobs Per Million Dollars Change in Final Demand","MyRegion",null,null,"MYREGION"]
["Agriculture",0,null,null,0]
["Mining",0,null,null,0]
["Construction",0,null,null,0]
{"$rows_left_out":199}
{"sheet":"DefaultData","index":6,"n_rows":66,"n_cols":58,"rows_kept":66,"cut":false,"hidden":false,"merged":[[0,0,16,1]]}
[2020,null,null,null,null,null,null,null,null,null,null,null,null,null,null,null,null,null,null,null,null,"Annual average change",null,null,null,null,null,null,null,null,null,null,null,null,null,null,null,null,null,null,null,null,null,null,null,null,null,null,"HVAC",null,"Labour cost"]
[null,null,null,null,null,null,null,null,null,null,null,null,null,null,null,null,null,null,null,null,null,-5.0000000000000001E-3,null,null,null,null,null,null,null,null,null,null,null,null,null,null,null,null,null,null,null,null,null,null,null,null,null,null,"Cold climate air-source heat pump",1,0.45]
[null,null,null,null,null,null,null,null,null,null,null,null,null,null,null,null,null,null,null,null,null,null,null,null,null,null,null,null,null,null,null,null,null,null,null,null,null,null,null,null,null,null,null,null,null,null,null,null,"Electric furnace",2,0.45]
[null,null,null,null,null,null,null,null,null,null,null,null,null,null,null,null,2021,2022,2023,2024,2025,2026,2027,2028,2029,2030,2031,2032,2033,2034,2035,2036,2037,2038,2039,2040,null,null,null,null,null,null,null,null,null,null,null,null,"Building envelop improvement",null,"Labour cost"]
[null,null,null,null,null,null,null,null,null,null,null,null,null,null,null,null,1,2,3,4,5,6,7,8,9,10,11,12,13,14,15,16,17,18,19,20,null,null,null,null,null,null,null,null,null,null,null,null,"Attic insulation (acheive a minimum RSI 8.81 or R-50)",3,0.7]
[null,null,null,"Number of installations",null,"Default Installation Cost per technology","Default Maintenance cost per techno / year",null,null,null,null,null,null,null,null,"Cold climate air-source heat pump",{"$f":"VLOOKUP(ProjectData!B$9,DefaultData!AW$12:BE$26,2,FALSE)","v":18368},{"$f":"Q6*(1+$V$2)","v":18276.16},{"$f":"R6*(1+$V$2)","v":18184.779200000001},18093.855304000001,18003.386027479999,17913.369097342598,17823.802251855886,17734.683240596605,17646.009824393623,17557.779775271654,17469.990876395295,17382.640922013317,17295.72771740325,17209.249078816232,17123.20283342215,17037.586819255041,16952.398885158764,16867.636890732971,16783.298706279307,16699.382212747911,null,null,null,null,null,null,null,null,null,null,null,null,"Flat roof and/or Cathedral ceiling insulation (acheive a minimum RSI 4.93 or R-28)",4,0.7]
[null,null,null,{"$f":"ProjectData!B12","v":12000},null,{"$f":"Q16","v":18276.16},{"$f":"Q17","v":230},null,null,null,null,null,null,null,null,"Electric furnace",{"$f":"VLOOKUP(ProjectData!B$9,DefaultData!AW$12:BE$26,3,FALSE)","v":5145},{"$f":"Q7*(1+$V$2)","v":5119.2749999999996},5093.6786249999996,5068.2102318749994,5042.8691807156247,5017.6548348120468,4992.5665606379862,4967.6037278347958,4942.7657091956216,4918.0518806496439,4893.4616212463952,4868.9943131401633,4844.6493415744626,4820.4260948665906,4796.3239643922579,4772.3423445702965,4748.4806328474451,4724.7382296832075,4701.1145385347918,4677.6089658421179,null,null,null,null,null,null,null,null,null,null,null,null,"Basement / Foundation insulation (insulate a minimum of 60% the area) ",5,0.7]
[null,null,null,null,null,null,null,null,null,null,null,null,null,null,null,"Attic insulation (acheive a minimum RSI 8.81 or R-50)",{"$f":"VLOOKUP(ProjectData!B$9,DefaultData!AW$12:BE$26,4,FALSE)","v":1971.6096367999205},1961.7515886159208,1951.9428306728412,1942.1831165194769,1932.4722009368795,1922.809839932195,1913.1957907325341,1903.6298117788715,1894.1116627199772,1884.6411044063773,1875.2178988843455,1865.8418093899238,1856.5126003429741,1847.2300373412593,1837.993887154553,1828.8039177187802,1819.6598981301863,1810.5615986395353,1801.5087906463377,1792.5012466931059,null,null,null,null,null,null,null,null,null,null,null,null,"Exterior wall insulation (100% of the area to 2012 NBC levels)",6,0.4]
[null,null,null,"Construction",null," User",null,null,null,null,null,null,null,null,null,"Flat roof and/or Cathedral ceiling insulation (acheive a minimum RSI 4.93 or R-28)",{"$f":"VLOOKUP(ProjectData!B$9,DefaultData!AW$12:BE$26,5,FALSE)","v":2207.0838363585449},2196.0484171767521,2185.0681750908684,2174.142834215414,2163.272120044337,2152.4557594441153,2141.6934806468948,2130.9850132436604,2120.3300881774421,2109.728437736555,2099.1797955478723,2088.6838965701331,2078.2404770872827,2067.8492747018463,2057.5100283283373,2047.2224781866955,2036.9863657957621,2026.8014339667834,2016.6674267969495,2006.5840896629647,null,null,null,null,null,null,null,null,null,null,null,null,"Air-sealing",7,0.7]
[null,null,null,"Installation cost per techno","Installations Cost","Maintenance cost per techno / year","Maintenance costs per year",null,null,null,null,null,null,null,null,"Basement / Foundation insulation (insulate a minimum of 60% the area) ",{"$f":"VLOOKUP(ProjectData!B$9,DefaultData!AW$12:BE$26,6,FALSE)","v":3814.7328484363657},{"$f":"Q10*(1+$V$2)","v":3795.659184194184},3776.680888273213,3757.7974838318469,3739.0084964126877,3720.3134539306243,3701.7118866609712,3683.2033272276663,3664.7873105915278,3646.4633740385702,3628.2310571683774,3610.0899018825357,3592.0394523731229,3574.0792551112572,3556.208858835701,3538.4278145415224,3520.7356754688149,3503.1319970914706,3485.6163371060134,3468.1882554204831,null,null,null,null,null,null,null,null,null,null,null,null,"Windows and doors replacement (U-Factor 1.08 W/m2-K, and Energy star qualified)",8,0.4]
{"$rows_left_out":57}
{"sheet":"Calculations","index":7,"n_rows":138,"n_cols":37,"rows_kept":138,"cut":false,"hidden":false,"merged":[[39,12,39,23],[31,12,31,23],[0,0,16,1]]}
["*** WARNING ***\n\nThis Worksheet contains Data and Formulas that are an integral part of the EI2 model.  \nAlthough the data and formulas are available for review they must not be changed.\nAny changes to the data or formulas will impact the analysis and may invalidate the model results.\n\nTo view the data and formulas simply scroll over to the adjacent columns to the right.",null,"Economic Impact Analysis for ",{"$f":"CONCATENATE(ProjectData!B12,\" \",ProjectData!B11,\" installations\")","v":"12000 Cold climate air-source heat pump installations"},null,"in",{"$f":"ProjectData!B9","v":"Alberta"}]
[]
[]
[null,null,null,"Cost","Purchased Local",null,"Local $ Spending",null,null,null,null,null,null,null,null,null,null,null,null,null,null,null,null,null,null,null,null,"Project Installation Costs ","Cost","Local Share"]
[]
[null,null,"Equipment & Installation costs",null,null,null,null,null,null,null,null,null,null,null,null,null,null,null,null,null,null,null,null,null,null,null,null,"Equipment & Installation costs"]
[null,null,{"$f":"DefaultData!C17","v":"Cold climate air-source heat pump"},{"$f":"IF(ProjectData!$B$21=\"y\",DefaultData!D17,ProjectData!B29)","v":120622656.00000001},{"$f":"IF(ProjectData!$B$21=\"y\",DefaultData!F17,ProjectData!E29)","v":1},null,{"$f":"D7*E7","v":120622656.00000001},null,null,null,null,null,null,null,null,null,null,null,null,null,null,null,null,null,null,null,null,{"$f":"C7","v":"Cold climate air-source heat pump"},{"$f":"D7","v":120622656.00000001},1]
[null,null,"Labour",{"$f":"IF(ProjectData!$B$21=\"y\",DefaultData!D18,ProjectData!B30)","v":98691264},{"$f":"IF(ProjectData!$B$21=\"y\",DefaultData!F18,ProjectData!E30)","v":1},null,{"$f":"D8*E8","v":98691264},null,null,null,null,null,null,null,null,null,null,null,null,null,null,null,null,null,null,null,null,"Labour",98691264,1]
[null,null,"Subtotal All Costs (without sales tax)",{"$f":"D7+D8","v":219313920},{"$f":"IF(ProjectData!$B$21=\"y\",DefaultData!F19,ProjectData!E31)","v":1},null,{"$f":"D9*E9","v":219313920},null,null,null,null,null,null,null,null,null,null,null,null,null,null,null,null,null,null,null,null,"Subtotal All Costs (without sales tax)",219313920,1]
[null,null,"Sales Tax",{"$f":"IF(ProjectData!$B$21=\"Y\",DefaultData!D20,ProjectData!B32)","v":0},{"$f":"IF(ProjectData!$B$21=\"y\",DefaultData!F20,ProjectData!E32)","v":1},null,{"$f":"D10*E10","v":0},null,null,null,null,null,null,null,null,null,null,null,null,null,null,null,null,null,null,null,null,"Sales Tax",0,1]
{"$rows_left_out":129}
{"sheet":"Deflators","index":8,"n_rows":60,"n_cols":49,"rows_kept":60,"cut":false,"hidden":false,"merged":[[0,0,16,1]]}
["*** WARNING ***\n\nThis Worksheet contains Data and Formulas that are an integral part of the EI2 model.  \nAlthough the data and formulas are available for review they must not be changed.\nAny changes to the data or formulas will impact the analysis and may invalidate the model results.\n\nTo view the data and formulas simply scroll over to the adjacent columns to the right.",null,"Deflators / Inflators"]
[null,null,"To assure consistency with multiplier data and project data"]
[]
[null,null,"Year of Multiplier Data",null,2017,null,null,null,"Deflator",{"$f":"HLOOKUP($E$5,D9:AW51,$D$60)","v":0.94890510948905105}]
[null,null,"Dollar Year $",null,{"$f":"ProjectData!B17","v":2020},null,null,null,"Inflator",{"$f":"HLOOKUP($E$5,D9:AW51,$D$59)","v":1.0538461538461539}]
[]
[]
[]
[null,null,null,2005,2006,2007,2008,2009,2010,2011,2012,2013,2014,2015,2016,2017,2018,2019,2020,2021,2022,2023,2024,2025,2026,2027,2028,2029,2030,2031,2032,2033,2034,2035,2036,2037,2038,2039,2040,2041,2042,2043,2044,2045,2046,2047,2048,2049,2050]
[null,null,2005,1,1.0186915887850467,1.0467289719626169,1.0654205607476634,1.0654205607476634,1.0934579439252334,1.1214953271028036,1.1401869158878504,1.1495327102803738,1.1682242990654206,1.1869158878504673,1.1962616822429906,1.2149532710280373,1.2429906542056075,1.2710280373831775,1.280373831775701,1.2990654205607475,1.3271028037383177,1.3457943925233644,1.3738317757009344,1.3925233644859811,1.4205607476635513,1.4485981308411215,1.485981308411215,1.514018691588785,1.5514018691588782,1.5794392523364484,1.6168224299065419,1.6542056074766354,1.6822429906542056,1.719626168224299,1.7570093457943923,1.7943925233644857,1.8224299065420559,1.8598130841121494,1.8971962616822426,1.9345794392523361,1.9813084112149533,2.018691588785047,2.0560747663551404,2.1028037383177569,2.1495327102803734,2.1869158878504669,2.2336448598130842,2.2803738317757007,2.3364485981308412]
{"$rows_left_out":51}
{"sheet":"Multipliers","index":9,"n_rows":329,"n_cols":26,"rows_kept":329,"cut":false,"hidden":false,"merged":[[0,0,16,1]]}
["*** WARNING ***\n\nThis Worksheet contains Data and Formulas that are an integral part of the EI2 model.  \nAlthough the data and formulas are available for review they must not be changed.\nAny changes to the data or formulas will impact the analysis and may invalidate the model results.\n\nTo view the data and formulas simply scroll over to the adjacent columns to the right.",null,{"$f":"ProjectData!B9","v":"Alberta"}]
[]
[]
[]
[null,null,"Multipliers"]
[null,null,null,"Jobs",null,null,"Earnings",null,null,"Output",null,null,"Value Added"]
[null,null,null,"Direct","Indirect","Induced","Direct","Indirect","Induced","Direct","Indirect","Induced","Direct","Indirect","Induced",null,null,null,null,"wage factor","Income tax",null,null,"CPP + EI",6.83E-2]
[null,null,"Agriculture",{"$f":"IF(C1=D44,M_CA,IF(C1=E44,M_AB,IF(C1=F44,M_BC,IF(C1=G44,M_MB,IF(C1=H44,M_NB,IF(C1=I44,M_NL,IF(C1=J44,M_NT,IF(C1=K44,M_NS,IF(C1=L44,M_NU,IF(C1=M44,M_ON,IF(C1=N44,M_PE,IF(C1=O44,M_QC,IF(C1=P44,M_SK,IF(C1=Q44,M_YK,IF(C1=R44,M_MR,M_0)))))))))))))))","v":2.2940527386729013},1.9750425956620221,0.51593913894350463,7.3079135790848945E-2,0.11875997599486887,2.6173647953961796E-2,1,0.58751951493484034,0.10204619543906382,0.46211098090700664,0.2596545939896881,6.3120526123851203E-2,null,null,null,"Canada",1,0.16,null,null,"QPP + EI",7.4800000000000005E-2,"Quebec"]
[null,null,"Mining",0.71394416125850468,1.6609846845741649,0.80523819342035574,0.13324700193082645,0.13721989990211844,4.0238380504414424E-2,1,0.4175383696517434,0.15862860272277921,0.54165475734401591,0.23363132532224554,9.8136950424575098E-2,null,null,null,"Alberta",1.1148962527098174,0.27]
[null,null,"Construction",3.4865808507104501,2.0789526318639258,1.3563346242124157,0.29457007747499669,0.16104352236118666,6.757569946374041E-2,1,0.49737581426511562,0.26628433052620709,0.41023870108301225,0.27109394040776225,0.16546476799882354,null,null,null,"British Columbia",0.99101889129761533,0.22]
{"$rows_left_out":320}
{"sheet":"Lists","index":10,"n_rows":33,"n_cols":9,"rows_kept":33,"cut":false,"hidden":false,"merged":[[0,0,16,1]]}
["*** WARNING ***\n\nThis Worksheet contains Data and Formulas that are an integral part of the EI2 model.  \nAlthough the data and formulas are available for review they must not be changed.\nAny changes to the data or formulas will impact the analysis and may invalidate the model results.\n\nTo view the data and formulas simply scroll over to the adjacent columns to the right."]
[null,null,"Years",null,"States",null,"Yes / No",null,"Technology/Service"]
[null,null,2010,null,"Canada",null,"Y",null,"Cold climate air-source heat pump"]
[null,null,2011,null,"Alberta",null,"N",null,"Electric furnace"]
[null,null,2012,null,"British Columbia",null,null,null,"Attic insulation (acheive a minimum RSI 8.81 or R-50)"]
[null,null,2013,null,"Manitoba",null,null,null,"Flat roof and/or Cathedral ceiling insulation (acheive a minimum RSI 4.93 or R-28)"]
[null,null,2014,null,"New Brunswick",null,null,null,"Basement / Foundation insulation (insulate a minimum of 60% the area) "]
[null,null,2015,null,"Newfoundland and Labrador",null,null,null,"Exterior wall insulation (100% of the area to 2012 NBC levels)"]
[null,null,2016,null,"Northwest Territories",null,null,null,"Air-sealing"]
[null,null,2017,null,"Nova Scotia",null,null,null,"Windows and doors replacement (U-Factor 1.08 W/m2-K, and Energy star qualified)"]
{"$rows_left_out":23}