{"text_format":"1","workbook":"xlsx","n_sheets":11,"sheets":["About EI2","FAQ","START","ProjectData","SummaryResults","User Add-in Location","DefaultData","Calculations","Deflators","Multipliers","Lists"],"not_rendered":{"charts":4,"images":0,"macros":1,"external_links":0,"defined_names":81,"comments":7,"pivot_tables":0},"unopened":[],"bounds":{"document_bytes":16777216,"sheet_cells":100000,"rows_first":2000,"rows_last":500,"rows_between":2000,"halvings":0,"cell_chars":16384,"cell_head_chars":4096},"cells_cut":0,"cells_raw":0,"read":"whole","date_system":"1900"}

{"sheet":"About EI2","index":0,"n_rows":21,"n_cols":2,"rows_kept":21,"cut":false,"hidden":false,"merged":[[7,1,11,1]]}
[null,"EI2 - WIND"]
[]
[null,"Economic Impacts of Electrification Initiatives (EI2) Model "]
[]
[]
[null,"Release Number: w-2021-03-31"]
[]
[null,"   The Economic Impacts of Electrification Initiatives (EI2) Model use the same structure as the Jobs and Economic Development Impact (JEDI) Model that was developed in 2002 to demonstrate the economic benefits associated with developing land-based wind power plants in the United States.  \nThe primary goal in developing the provincial / territorial level model is to provide a tool for wind developers, renewable energy advocates, government officials, decision makers and other potential users, to easily identify the local economic impacts associated with constructing and operating wind power plants. The second goal was to facilitate broad access and usage of the model. "]
[]
[]
{"$rows_left_out":12}
{"sheet":"FAQ","index":1,"n_rows":80,"n_cols":2,"rows_kept":80,"cut":false,"hidden":false,"merged":[]}
[]
[null,"EI2 - WIND"]
[]
[null,"Economic Impacts of Electrification Initiatives (EI2) Model "]
[]
[null,"Frequently Asked Questions (FAQ)"]
[]
[]
[null,"How do I know if I have the most current version of the EI2 model?"]
[null,"The most current version of the EI2 model is available on the Energy Modelling initiative web site at https://emi-ime.ca/.  "]
{"$rows_left_out":71}
{"sheet":"START","index":2,"n_rows":4,"n_cols":2,"rows_kept":4,"cut":false,"hidden":false,"merged":[]}
[]
[]
[null,"EI2 - WIND"]
[null,"Economic Impacts of Electrification Initiatives (EI2) Model "]

{"sheet":"ProjectData","index":3,"n_rows":118,"n_cols":36,"rows_kept":118,"cut":false,"hidden":false,"merged":[[84,0,84,5],[2,0,2,5],[22,0,22,2],[23,0,23,5],[61,0,61,5],[24,0,24,5]]}
["Wind Farm Project Data"]
[]
["INSTRUCTIONS:      \n   - Begin by entering Project Location (from pull-down list) and other Descriptive Data.  \t\t\t\t\t\n   - After inserting required data press enter (or cursor to the next cell) to continue.\t\t\t\t\t\n   - Once Descriptive Data is complete, choose \"Y\" or \"N\" on Line 20 to continue.\t\t\t\t\t\n   - Choose \"Y\" to accept Project Cost and Local Share defaults or \"N\" to review/modify values.\n   - Once all values are entered, click the \"Go to Summary Impacts\" button.\n\t\t\t\t\t\nTo utilize new values in analysis you must choose an \"N\" in \"Utilize Model Default Values (below)?\" - Line 20\t\t\nAdditional information is available by pointing to the red triangles located in cell corners and in the FAQ tab.\t\t\t\t\t\nOnly those cells with a white background can be changed (accept new values).  \t"]
[]
[]
["Project Descriptive Data"]
["Project Description"]
["Project Name ","Project 1",{"$f":"IF(B9=\"MYREGION\",IF('User Add-in Location'!E22=0,\"   Error - No Regional multiplier data in User Add-in Location\",\"\"),\"\")","v":""}]
["Project Location","Alberta",{"$f":"IF(B9=\"MYREGION\",IF('User Add-in Location'!E22=0,\"\",\"          Enter Region Population\"),\"\")","v":""},null,null,null,null,null,null,null,null,null,null,null,null,null,null,null,null,null,null,null,null,null,null,null,{"$f":"IF(B9=\"MYREGION\",IF(B10=\"\",2,1),0)","v":0}]
[{"$f":"IF(B9=\"MYREGION\",\"Population (only required for Region analysis)\",\"\")","v":""},null,{"$f":"IF($C9=\"\",\"\",IF($B10<1,\"      **Error - Population Data Missing**\",\"\"))","v":""}]
{"$rows_left_out":109}
{"sheet":"SummaryResults","index":4,"n_rows":143,"n_cols":37,"rows_kept":143,"cut":false,"hidden":false,"merged":[[38,0,38,4]]}
[{"$f":"CONCATENATE(\"Wind Farm - Project Data Summary based on \",$AE$4, \" values\")","v":"Wind Farm - Project Data Summary based on User Data values"}]
["Project Location",null,{"$f":"IF(ProjectData!B9=\"MyCounty\",'User Add-in Location'!#REF!,ProjectData!B9)","v":"Alberta"},null,null,null,null,null,null,null,null,null,null,null,null,null,null,null,null,null,null,null,null,null,null,null,null,null,null,null,{"$f":"D8+D9","v":2045.2504285992352},{"$f":"ProjectData!B20","v":"Y"}]
["Year of Construction ",null,{"$f":"ProjectData!B15","v":2022},null,null,null,null,null,null,null,null,null,null,null,null,null,null,null,null,null,null,null,null,null,null,null,null,null,null,null,{"$f":"DefaultData!E46+DefaultData!E80","v":2045.250428599235}]
["Total Project Size - Nameplate Capacity (MW)",null,{"$f":"ProjectData!B11","v":100},null,null,null,null,null,null,null,null,null,null,null,null,null,null,null,null,null,null,null,null,null,null,null,null,null,null,null,{"$f":"IF(AND(AE2=AE3,AF2=\"Y\"),\"Model Default Data\",\"User Data\")","v":"User Data"}]
[]
["Turbine Size (kW)",null,{"$f":"ProjectData!B12","v":2500},null,null,null,null,null,null,null,null,null,null,null,null,null,null,null,null,null,null,null,null,null,null,null,null,null,null,null,{"$f":"_xlfn.CONCAT(\"EI2-WIND_\",ProjectData!B8)","v":"EI2-WIND_Project 1"}]
["Number of Turbines",null,{"$f":"ProjectData!B13","v":40}]
["Installed Project Cost ($/kW)",null,{"$f":"Calculations!D37/(C4*1000)","v":2020.2504285992347},{"$f":"ProjectData!C57","v":2020.2504285992352},"without taxes"]
["Annual O&M Cost ($/kW)",null,{"$f":"Calculations!D93","v":25},{"$f":"ProjectData!C69+ProjectData!C79","v":25},"without taxes"]
["Money Value (Dollar Year)",null,{"$f":"ProjectData!B16","v":2020}]
{"$rows_left_out":134}
{"sheet":"User Add-in Location","index":5,"n_rows":208,"n_cols":6,"rows_kept":208,"cut":false,"hidden":false,"merged":[]}
["Multipliers For Economic Input-Output Analysis"]
[]
["MYREGION (Name)",null,"Year of Data",null,""]
["Province or Territory (Name)"]
[]
["Jobs Direct Multipliers",null,null,null,"Personal Consumption Expenditures (PCE)"]
["Jobs Per Million Dollars Change in Final Demand","MyRegion",null,null,"MYREGION"]
["Agriculture",0,null,null,0]
["Mining",0,null,null,0]
["Construction",0,null,null,0]
{"$rows_left_out":199}
{"sheet":"DefaultData","index":6,"n_rows":158,"n_cols":49,"rows_kept":158,"cut":false,"hidden":false,"merged":[[0,0,16,1]]}
["*** WARNING ***\n\nThis Worksheet contains Data and Formulas that are an integral part of the EI2 model.  \nAlthough the data and formulas are available for review they must not be changed.\nAny changes to the data or formulas will impact the analysis and may invalidate the model results.\n\nTo view the data and formulas simply scroll over to the adjacent columns to the right.",null,null,null,null,null,null,null,null,null,null,null,null,null,null,null,null,null,"Annual average change"]
[null,null,null,null,null,null,null,null,null,null,"Default",null,null,null,null,null,null,null,-0.01]
[null,null,null,null,null,null,null,"Const Jobs/",{"$f":"E5","v":100},"O&M Jobs/",{"$f":"E5","v":100},"MW",null,null,"Average installed project cost per kW",null,null,{"$f":"HLOOKUP(Year_of_Construction,O4:AC5,2,FALSE)","v":1999.8}]
[null,null,null,"Number of Turbines","MW","Total Installed Cost",null,"Foundation",{"$f":"I$3*AM30","v":22.825865950493196},"Field Tech",{"$f":"K$3*AP56","v":4},null,null,null,2016,2017,2018,2019,2020,2021,2022,2023,2024,2025,{"$f":"X4+1","v":2026},2027,2028,2029,2030,2031,2032,2033,2034,2035,2036,2037,2038,2039,2040]
[null,null,null,{"$f":"ROUNDUP(ProjectData!B11*1000/ProjectData!B12,0)","v":40},{"$f":"ProjectData!B11","v":100},2020,null,"Erection",{"$f":"I$3*AM31","v":22.825865950493196},"Admin",{"$f":"K$3*AP57","v":1},null,null,null,2020,2020,2020,2020,2020,2020,{"$f":"T5*(1+$S2)","v":1999.8},1979.8019999999999,1960.00398,1940.4039401999999,1920.9999007979998,1901.7899017900197,1882.7720027721195,1863.9442827443984,1845.3048399169543,1827,1827,1827,1827,1827,1827,1827,1827,1827,1827]
[null,null,null,null,null,null,null,"Electrical",25.108452545542516,"Management",{"$f":"K$3*AP58","v":1}]
[null,null,null,"Construction",null," User",null,"Management/supervision",14.239815553471088,"Total",{"$f":"SUM(K4:K6)","v":6},null,null,null,null,"Construction Loc. Adj.",null,{"$f":"VLOOKUP(ProjectData!B9,Multipliers!S8:T22,2,FALSE)","v":1.0979511095684147},null,null,null,null,null,null,null,null,null,null,null,null,null,null,null,null,null,null,"Avg. Turbine Size (KW)",null,null,"O&M Cost adjustment "]
[null,null,null,"Cost per KW","Project Cost","Selected Cost Per KW","Default Cost Per KW","MW Per Turbine",{"$f":"SUM(I4:I7)","v":85},null,null,null,null,null,null,"Adj. Installed Cost (per KW)",null,{"$f":"Y46","v":2025.2762431107647},null,null,null,null,null,null,null,null,null,null,null,null,null,null,null,null,null,null,null,1500,null,"<=20 MW",{"$f":"25+Z119","v":25.500472895138206},"per KW"]
[null,null,null,{"$f":"ProjectData!B18","v":2020},{"$f":"D9*ProjectData!B11*1000","v":202000000},{"$f":"ProjectData!B19","v":25},25,{"$f":"ProjectData!B12","v":2500},null,null,null,null,null,null,null,null,null,null,null,null,null,null,null,null,null,null,null,null,null,null,null,null,null,null,null,null,null,null,null,"100 MW",{"$f":"20+Z119","v":20.500472895138206},{"$f":"AP8","v":"per KW"}]
[]
{"$rows_left_out":149}
{"sheet":"Calculations","index":7,"n_rows":233,"n_cols":37,"rows_kept":233,"cut":false,"hidden":false,"merged":[[39,12,39,23],[31,12,31,23],[0,0,16,1]]}
["*** WARNING ***\n\nThis Worksheet contains Data and Formulas that are an integral part of the EI2 model.  \nAlthough the data and formulas are available for review they must not be changed.\nAny changes to the data or formulas will impact the analysis and may invalidate the model results.\n\nTo view the data and formulas simply scroll over to the adjacent columns to the right.",null,"Economic Impact Analysis for ",null,{"$f":"ProjectData!B9","v":"Alberta"},"Wind Power Plant"]
[]
[null,null,"Project Construction Costs "]
[null,null,null,"Cost","Purchased Local",null,"Local $ Spending",null,null,null,null,null,null,null,null,null,null,null,null,null,null,null,null,null,null,null,null,"Construction Costs ","Cost","Local Share"]
[null,null,"Balance of Plant",null,null,null,null,null,null,null,null,null,null,null,null,null,null,null,null,null,null,null,null,null,null,null,null,"Balance of Plant"]
[null,null,"  Materials",null,null,null,null,null,null,null,null,null,null,null,null,null,null,null,null,null,null,null,null,null,null,null,null,"  Materials"]
[null,null,"    Construction (concrete rebar, equip, roads and site prep)",{"$f":"IF(ProjectData!$B$20=\"y\",DefaultData!D18,ProjectData!B35)","v":21745654.500851437},{"$f":"IF(ProjectData!$B$20=\"y\",IF(ProjectData!AA$9=0,DefaultData!G18,ProjectData!AA35),ProjectData!E35)","v":0.9},null,{"$f":"D7*E7","v":19571089.050766293},null,null,null,null,null,null,null,null,null,null,null,null,null,null,null,null,null,null,null,null,"    Construction (concrete rebar, equip, roads and site prep)",{"$f":"D7","v":21745654.500851437},0.9]
[null,null,"    Transformer",{"$f":"IF(ProjectData!$B$20=\"y\",DefaultData!D19,ProjectData!B36)","v":2459884.3478065953},{"$f":"IF(ProjectData!$B$20=\"y\",IF(ProjectData!AA$9=0,DefaultData!G19,ProjectData!AA36),ProjectData!E36)","v":0},null,{"$f":"D8*E8","v":0},null,null,null,null,null,null,null,null,null,null,null,null,null,null,null,null,null,null,null,null,"    Transformer",2459884.3478065953,0]
[null,null,"    Electrical (drop cable, wire, )",{"$f":"IF(ProjectData!$B$20=\"y\",DefaultData!D20,ProjectData!B37)","v":2592884.3197763958},{"$f":"IF(ProjectData!$B$20=\"y\",IF(ProjectData!AA$9=0,DefaultData!G20,ProjectData!AA37),ProjectData!E37)","v":1},null,{"$f":"D9*E9","v":2592884.3197763958},null,null,null,null,null,null,null,null,null,null,null,null,null,null,null,null,null,null,null,null,"    Electrical (drop cable, wire, )",2592884.3197763958,1]
[null,null,"    HV line extension",{"$f":"IF(ProjectData!$B$20=\"y\",DefaultData!D21,ProjectData!B38)","v":4736334.622701399},{"$f":"IF(ProjectData!$B$20=\"y\",IF(ProjectData!AA$9=0,DefaultData!G21,ProjectData!AA38),ProjectData!E38)","v":0.7},null,{"$f":"D10*E10","v":3315434.2358909789},null,null,null,null,null,null,null,null,null,null,null,null,null,null,null,null,null,null,null,null,"    HV line extension",4736334.622701399,0.7]
{"$rows_left_out":224}
{"sheet":"Deflators","index":8,"n_rows":60,"n_cols":49,"rows_kept":60,"cut":false,"hidden":false,"merged":[[0,0,16,1]]}
["*** WARNING ***\n\nThis Worksheet contains Data and Formulas that are an integral part of the EI2 model.  \nAlthough the data and formulas are available for review they must not be changed.\nAny changes to the data or formulas will impact the analysis and may invalidate the model results.\n\nTo view the data and formulas simply scroll over to the adjacent columns to the right.",null,"Deflators / Inflators"]
[null,null,"To assure consistency with multiplier data and project data"]
[]
[null,null,"Year of Multiplier Data",null,2017,null,null,null,"Deflator",{"$f":"HLOOKUP($E$5,D9:AW51,$D$60)","v":0.94890510948905105}]
[null,null,"Dollar Year $",null,{"$f":"ProjectData!B16","v":2020},null,null,null,"Inflator",{"$f":"HLOOKUP($E$5,D9:AW51,$D$59)","v":1.0538461538461539}]
[]
[]
[]
[null,null,null,2005,2006,2007,2008,2009,2010,2011,2012,2013,2014,2015,2016,2017,2018,2019,2020,2021,2022,2023,2024,2025,2026,2027,2028,2029,2030,2031,2032,2033,2034,2035,2036,2037,2038,2039,2040,2041,2042,2043,2044,2045,2046,2047,2048,2049,2050]
[null,null,2005,1,1.0186915887850467,1.0467289719626169,1.0654205607476634,1.0654205607476634,1.0934579439252334,1.1214953271028036,1.1401869158878504,1.1495327102803738,1.1682242990654206,1.1869158878504673,1.1962616822429906,1.2149532710280373,1.2429906542056075,1.2710280373831775,1.280373831775701,1.2990654205607475,1.3271028037383177,1.3457943925233644,1.3738317757009344,1.3925233644859811,1.4205607476635513,1.4485981308411215,1.485981308411215,1.514018691588785,1.5514018691588782,1.5794392523364484,1.6168224299065419,1.6542056074766354,1.6822429906542056,1.719626168224299,1.7570093457943923,1.7943925233644857,1.8224299065420559,1.8598130841121494,1.8971962616822426,1.9345794392523361,1.9813084112149533,2.018691588785047,2.0560747663551404,2.1028037383177569,2.1495327102803734,2.1869158878504669,2.2336448598130842,2.2803738317757007,2.3364485981308412]
{"$rows_left_out":51}
{"sheet":"Multipliers","index":9,"n_rows":348,"n_cols":26,"rows_kept":348,"cut":false,"hidden":false,"merged":[[0,0,16,1]]}
["*** WARNING ***\n\nThis Worksheet contains Data and Formulas that are an integral part of the EI2 model.  \nAlthough the data and formulas are available for review they must not be changed.\nAny changes to the data or formulas will impact the analysis and may invalidate the model results.\n\nTo view the data and formulas simply scroll over to the adjacent columns to the right.",null,{"$f":"ProjectData!B9","v":"Alberta"}]
[]
[]
[]
[null,null,"Multipliers"]
[null,null,null,"Jobs",null,null,"Earnings",null,null,"Output",null,null,"Value Added"]
[null,null,null,"Direct","Indirect","Induced","Direct","Indirect","Induced","Direct","Indirect","Induced","Direct","Indirect","Induced",null,null,null,null,"wage factor","Income tax",null,null,"CPP + EI",6.83E-2]
[null,null,"Agriculture",{"$f":"IF(C1=D44,M_CA,IF(C1=E44,M_AB,IF(C1=F44,M_BC,IF(C1=G44,M_MB,IF(C1=H44,M_NB,IF(C1=I44,M_NL,IF(C1=J44,M_NT,IF(C1=K44,M_NS,IF(C1=L44,M_NU,IF(C1=M44,M_ON,IF(C1=N44,M_PE,IF(C1=O44,M_QC,IF(C1=P44,M_SK,IF(C1=Q44,M_YK,IF(C1=R44,M_MR,M_0)))))))))))))))","v":2.2940527386729013},1.9750425956620221,0.51593913894350463,7.3079135790848945E-2,0.11875997599486887,2.6173647953961796E-2,1,0.58751951493484034,0.10204619543906382,0.46211098090700664,0.2596545939896881,6.3120526123851203E-2,null,null,null,"Canada",1,0.16,null,null,"QPP + EI",7.4800000000000005E-2,"Quebec"]
[null,null,"Mining",0.71394416125850468,1.6609846845741649,0.80523819342035574,0.13324700193082645,0.13721989990211844,4.0238380504414424E-2,1,0.4175383696517434,0.15862860272277921,0.54165475734401591,0.23363132532224554,9.8136950424575098E-2,null,null,null,"Alberta",1.0979511095684147,0.27]
[null,null,"Construction",3.4865808507104501,2.0789526318639258,1.3563346242124157,0.29457007747499669,0.16104352236118666,6.757569946374041E-2,1,0.49737581426511562,0.26628433052620709,0.41023870108301225,0.27109394040776225,0.16546476799882354,null,null,null,"British Columbia",0.98469163777502611,0.22]
{"$rows_left_out":339}
{"sheet":"Lists","index":10,"n_rows":28,"n_cols":7,"rows_kept":28,"cut":false,"hidden":false,"merged":[[0,0,16,1]]}
["*** WARNING ***\n\nThis Worksheet contains Data and Formulas that are an integral part of the EI2 model.  \nAlthough the data and formulas are available for review they must not be changed.\nAny changes to the data or formulas will impact the analysis and may invalidate the model results.\n\nTo view the data and formulas simply scroll over to the adjacent columns to the right."]
[null,null,"Years",null,"States",null,"Yes / No"]
[null,null,2010,null,"Canada",null,"Y"]
[null,null,2011,null,"Alberta",null,"N"]
[null,null,2012,null,"British Columbia"]
[null,null,2013,null,"Manitoba"]
[null,null,2014,null,"New Brunswick"]
[null,null,2015,null,"Newfoundland and Labrador"]
[null,null,2016,null,"Northwest Territories"]
[null,null,2017,null,"Nova Scotia"]
{"$rows_left_out":18}